﻿2026-07-31T04:41:11.4334705Z ##[group]Run cargo test --workspace --lib --bins
2026-07-31T04:41:11.4335139Z [36;1mcargo test --workspace --lib --bins[0m
2026-07-31T04:41:11.4340326Z shell: C:\Program Files\PowerShell\7\pwsh.EXE -command ". '{0}'"
2026-07-31T04:41:11.4340721Z ##[endgroup]
2026-07-31T04:41:18.6623079Z    Compiling fastrand v2.4.1
2026-07-31T04:41:19.2229172Z    Compiling futures-lite v2.6.1
2026-07-31T04:41:19.2955426Z    Compiling tempfile v3.27.0
2026-07-31T04:41:19.5675426Z    Compiling backon v1.6.0
2026-07-31T04:41:19.5729400Z    Compiling bytemuck v1.25.2
2026-07-31T04:41:19.5758929Z    Compiling mock-adapter v0.47.0 (C:\actions-runner\_work\spt-bs-core\spt-bs-core\adapters\mock)
2026-07-31T04:41:19.5759736Z    Compiling spt-proto v0.47.0 (C:\actions-runner\_work\spt-bs-core\spt-bs-core\crates\spt-proto)
2026-07-31T04:41:19.5868126Z    Compiling spt-test-support v0.47.0 (C:\actions-runner\_work\spt-bs-core\spt-bs-core\crates\spt-test-support)
2026-07-31T04:41:20.0095370Z    Compiling spt-store v0.47.0 (C:\actions-runner\_work\spt-bs-core\spt-bs-core\crates\spt-store)
2026-07-31T04:41:20.0109744Z    Compiling spt-runtime v0.47.0 (C:\actions-runner\_work\spt-bs-core\spt-bs-core\crates\spt-runtime)
2026-07-31T04:41:20.0133488Z    Compiling spt-live v0.47.0 (C:\actions-runner\_work\spt-bs-core\spt-bs-core\crates\spt-live)
2026-07-31T04:41:20.0878469Z    Compiling rgb v0.8.53
2026-07-31T04:41:20.2150125Z    Compiling n0-future v0.3.2
2026-07-31T04:41:20.2568406Z    Compiling spt-msg v0.47.0 (C:\actions-runner\_work\spt-bs-core\spt-bs-core\crates\spt-msg)
2026-07-31T04:41:20.4850144Z    Compiling n0-watcher v0.6.1
2026-07-31T04:41:20.4851874Z    Compiling iroh-dns v0.98.0
2026-07-31T04:41:20.9163075Z    Compiling netwatch v0.16.0
2026-07-31T04:41:21.0350159Z    Compiling avt v0.18.0
2026-07-31T04:41:21.8555909Z    Compiling iroh-relay v0.98.0
2026-07-31T04:41:24.0960760Z    Compiling portmapper v0.16.0
2026-07-31T04:41:25.6160276Z    Compiling spt-term v0.47.0 (C:\actions-runner\_work\spt-bs-core\spt-bs-core\crates\spt-term)
2026-07-31T04:41:33.7258345Z    Compiling iroh v0.98.2
2026-07-31T04:41:47.9299154Z    Compiling spt-net v0.47.0 (C:\actions-runner\_work\spt-bs-core\spt-bs-core\crates\spt-net)
2026-07-31T04:41:50.2279621Z    Compiling spt-daemon v0.47.0 (C:\actions-runner\_work\spt-bs-core\spt-bs-core\crates\spt-daemon)
2026-07-31T04:42:09.2924502Z    Compiling spt v0.47.0 (C:\actions-runner\_work\spt-bs-core\spt-bs-core\crates\spt)
2026-07-31T04:42:09.2927035Z    Compiling xtask v0.47.0 (C:\actions-runner\_work\spt-bs-core\spt-bs-core\crates\xtask)
2026-07-31T04:42:26.3959967Z     Finished `test` profile [unoptimized + debuginfo] target(s) in 1m 13s
2026-07-31T04:42:26.4317410Z      Running unittests src\capture_player.rs (target\debug\deps\capture_player-84a75d77b2d165f9.exe)
2026-07-31T04:42:26.5153400Z 
2026-07-31T04:42:26.5153725Z running 2 tests
2026-07-31T04:42:26.5159158Z test tests::parses_a_well_formed_record ... ok
2026-07-31T04:42:26.5159495Z test tests::refuses_a_length_mismatch ... ok
2026-07-31T04:42:26.5159729Z 
2026-07-31T04:42:26.5159969Z test result: ok. 2 passed; 0 failed; 0 ignored; 0 measured; 0 filtered out; finished in 0.00s
2026-07-31T04:42:26.5160329Z 
2026-07-31T04:42:26.5168667Z      Running unittests src\console_mode_probe.rs (target\debug\deps\console_mode_probe-d91fa02ff96577ea.exe)
2026-07-31T04:42:26.5937062Z 
2026-07-31T04:42:26.5937375Z running 0 tests
2026-07-31T04:42:26.5937538Z 
2026-07-31T04:42:26.5937792Z test result: ok. 0 passed; 0 failed; 0 ignored; 0 measured; 0 filtered out; finished in 0.00s
2026-07-31T04:42:26.5938142Z 
2026-07-31T04:42:26.5949071Z      Running unittests src\main.rs (target\debug\deps\mock_session-913c6f569abb0eba.exe)
2026-07-31T04:42:26.6720785Z 
2026-07-31T04:42:26.6721104Z running 0 tests
2026-07-31T04:42:26.6721226Z 
2026-07-31T04:42:26.6721397Z test result: ok. 0 passed; 0 failed; 0 ignored; 0 measured; 0 filtered out; finished in 0.00s
2026-07-31T04:42:26.6721604Z 
2026-07-31T04:42:26.6733062Z      Running unittests src\shell.rs (target\debug\deps\mock_shell-4153450c5e0c04ba.exe)
2026-07-31T04:42:26.7486494Z 
2026-07-31T04:42:26.7486777Z running 0 tests
2026-07-31T04:42:26.7486909Z 
2026-07-31T04:42:26.7487072Z test result: ok. 0 passed; 0 failed; 0 ignored; 0 measured; 0 filtered out; finished in 0.00s
2026-07-31T04:42:26.7487290Z 
2026-07-31T04:42:26.7499040Z      Running unittests tests\fixtures\gh_fixture.rs (target\debug\deps\gh_fixture-ecc23862a3fbe40c.exe)
2026-07-31T04:42:26.9818771Z 
2026-07-31T04:42:26.9819147Z running 0 tests
2026-07-31T04:42:26.9819265Z 
2026-07-31T04:42:26.9819435Z test result: ok. 0 passed; 0 failed; 0 ignored; 0 measured; 0 filtered out; finished in 0.00s
2026-07-31T04:42:26.9819704Z 
2026-07-31T04:42:26.9831259Z      Running unittests tests\fixtures\git_fixture.rs (target\debug\deps\git_fixture-b85d451740889423.exe)
2026-07-31T04:42:27.0697540Z 
2026-07-31T04:42:27.0697893Z running 0 tests
2026-07-31T04:42:27.0698018Z 
2026-07-31T04:42:27.0698189Z test result: ok. 0 passed; 0 failed; 0 ignored; 0 measured; 0 filtered out; finished in 0.00s
2026-07-31T04:42:27.0698425Z 
2026-07-31T04:42:27.0710003Z      Running unittests tests\fixtures\post_step_fixture.rs (target\debug\deps\post_step_fixture-fbadfeb8eba9ff1b.exe)
2026-07-31T04:42:27.1469737Z 
2026-07-31T04:42:27.1470078Z running 0 tests
2026-07-31T04:42:27.1470188Z 
2026-07-31T04:42:27.1470353Z test result: ok. 0 passed; 0 failed; 0 ignored; 0 measured; 0 filtered out; finished in 0.00s
2026-07-31T04:42:27.1470563Z 
2026-07-31T04:42:27.1482727Z      Running unittests src\main.rs (target\debug\deps\spt-b39679f88e654a40.exe)
2026-07-31T04:42:28.0053266Z 
2026-07-31T04:42:28.0053607Z running 475 tests
2026-07-31T04:42:28.0058373Z test accessview::tests::drill_matches_only_its_own_kind ... ok
2026-07-31T04:42:28.0060075Z test accessview::tests::node_roster_lists_node_scope_entities_and_mode_exceptions ... ok
2026-07-31T04:42:28.0060449Z test accessview::tests::target_roster_groups_types_and_counts_rules ... ok
2026-07-31T04:42:28.0063382Z test api::auth::tests::mints_distinct_nonempty_tokens ... ok
2026-07-31T04:42:28.0063768Z test api::auth::tests::missing_endpoint_is_no_endpoint ... ok
2026-07-31T04:42:30.2834781Z test api::auth::tests::dead_owner_repin_refused_when_sid_owns_another_perch ... ok
2026-07-31T04:42:30.3373987Z test api::auth::tests::dead_owner_repin_still_rescues_a_non_custody_sid ... ok
2026-07-31T04:42:30.3685060Z test api::auth::tests::live_owner_mismatch_still_refuses ... ok
2026-07-31T04:42:30.4344833Z test api::auth::tests::dead_owner_repin_refused_when_sid_is_a_psyche_custody_sid ... ok
2026-07-31T04:42:30.4353773Z test api::delivery::tests::inject_all_pty_falls_back_to_hook ... ok
2026-07-31T04:42:30.4356256Z test api::delivery::tests::inject_resolution_drops_pty_defaults_hook ... ok
2026-07-31T04:42:30.4450506Z test api::auth::tests::no_proof_is_refused ... ok
2026-07-31T04:42:30.4786616Z test api::auth::tests::pinned_to_dead_sid_mismatched_poll_repins ... ok
2026-07-31T04:42:30.4926410Z test api::auth::tests::session_id_proof_authenticates ... ok
2026-07-31T04:42:30.5074279Z test api::auth::tests::token_proof_authenticates ... ok
2026-07-31T04:42:30.5075197Z test api::auth::tests::worker_missing_is_no_endpoint ... ok
2026-07-31T04:42:30.5404701Z test api::auth::tests::worker_parent_current_sid_authenticates_after_rotation ... ok
2026-07-31T04:42:30.5566167Z test api::auth::tests::token_auth_path_unchanged ... ok
2026-07-31T04:42:30.5567604Z test api::engineroom::tests::a_refresh_adopts_only_a_real_divergence ... ok
2026-07-31T04:42:30.5572147Z test api::engineroom::tests::an_admin_code_verifies_across_the_ceremony_window_only ... ok
2026-07-31T04:42:30.5573229Z test api::engineroom::tests::subnet_authority_is_the_empowerment_not_the_gate ... ok
2026-07-31T04:42:30.5574416Z test api::engineroom::tests::the_gate_admits_only_the_reserved_id_provisioned_and_authenticated ... ok
2026-07-31T04:42:30.5575431Z test api::engineroom::tests::the_written_node_mode_is_the_one_the_chain_reads ... ok
2026-07-31T04:42:30.5812419Z test api::auth::tests::worker_stored_sid_authenticates ... ok
2026-07-31T04:42:30.6025000Z test api::auth::tests::worker_wrong_sid_and_token_only_refused ... ok
2026-07-31T04:42:30.6173401Z test api::auth::tests::wrong_token_and_wrong_session_refused ... ok
2026-07-31T04:42:30.6640433Z test api::delivery::tests::an_undated_state_is_dated_by_a_non_edge_report ... ok
2026-07-31T04:42:30.6729049Z test api::delivery::tests::echo_gate_explicit_toggle ... ok
2026-07-31T04:42:30.6947184Z test api::delivery::tests::idle_busy_transitions_manage_sentinels ... ok
2026-07-31T04:42:30.8891336Z test api::delivery::tests::idle_drain_peek_returns_non_deferred_rows_only ... ok
2026-07-31T04:42:30.8895790Z test api::reporting::tests::capability_lists_hostable_types ... ok
2026-07-31T04:42:30.9071723Z test api::delivery::tests::idle_no_gate_does_not_arm_gate ... ok
2026-07-31T04:42:30.9963535Z test api::delivery::tests::only_a_real_state_edge_stamps_the_transition_instant ... ok
2026-07-31T04:42:31.1887689Z test api::delivery::tests::poll_drain_holds_deferred_while_resting_and_releases_once_on_wake ... ok
2026-07-31T04:42:31.1889977Z test api::reporting::tests::endpoint_info_attached_node_from_honest_stamps ... ok
2026-07-31T04:42:31.1891291Z test api::reporting::tests::endpoint_info_attached_node_self_attributes_own_node_driver ... ok
2026-07-31T04:42:31.1894259Z test api::reporting::tests::endpoint_info_json_always_carries_an_activity_word ... ok
2026-07-31T04:42:31.4323721Z test api::delivery::tests::poll_drain_suppresses_idle_only_which_reaches_the_relay ... ok
2026-07-31T04:42:31.4328330Z test api::reporting::tests::env_aliases_resolved_from_manifest ... ok
2026-07-31T04:42:31.6233115Z test api::delivery::tests::poll_drain_validates_notify_copies_against_their_rows ... ok
2026-07-31T04:42:31.6236364Z test api::reporting::tests::filedrops_are_fixed_named_files ... ok
2026-07-31T04:42:31.8592162Z test api::delivery::tests::poll_drains_non_deferred_by_default ... ok
2026-07-31T04:42:31.9851166Z test api::delivery::tests::poll_only_drains_when_hook_method_present ... ok
2026-07-31T04:42:32.1312425Z test api::engineroom::tests::a_non_engine_room_attempt_never_touches_the_empower_ledger ... ok
2026-07-31T04:42:32.8095149Z test api::reporting::tests::boundary_appends_to_the_session_ledger ... ok
2026-07-31T04:42:33.0270540Z test api::reporting::tests::boundary_missing_perch_refused ... ok
2026-07-31T04:42:33.0365832Z test api::reporting::tests::boundary_injects_deferred_shell_context ... ok
2026-07-31T04:42:33.1401510Z test api::reporting::tests::boundary_rebinds_keeping_anchor ... ok
2026-07-31T04:42:33.1615353Z test api::reporting::tests::boundary_refuses_rotating_onto_a_psyche_custody_sid ... ok
2026-07-31T04:42:33.3638865Z test api::reporting::tests::boundary_resurfaces_undismissed_notifs ... ok
2026-07-31T04:42:33.3761846Z test api::startup::tests::a_dead_binder_pid_proves_nothing_and_never_drops_the_stamp ... ok
2026-07-31T04:42:33.3763067Z test api::startup::tests::a_dead_relays_capability_stamp_is_not_resurrected_by_a_listener_rebind ... ok
2026-07-31T04:42:33.4779353Z test api::reporting::tests::boundary_with_a_fresh_sid_is_unaffected_by_the_squat_guard ... ok
2026-07-31T04:42:33.4803882Z test api::reporting::tests::digest_entry_validates_and_appends_to_digest_log ... ok
2026-07-31T04:42:33.5018199Z test api::reporting::tests::driven_by_reads_daemon_marker ... ok
2026-07-31T04:42:33.5355813Z test api::reporting::tests::endpoint_info_activity_word_tracks_the_idle_sentinel ... ok
2026-07-31T04:42:33.5581157Z test api::reporting::tests::endpoint_info_reports_and_refuses ... ok
2026-07-31T04:42:33.6211802Z test api::reporting::tests::erase_unregisters_regardless_of_liveness ... ok
2026-07-31T04:42:33.6376808Z test api::reporting::tests::hint_once_per_session_one_per_message ... ok
2026-07-31T04:42:33.6595841Z test api::reporting::tests::history_log_appends ... ok
2026-07-31T04:42:33.6655796Z test api::reporting::tests::presence_records_endpoint ... ok
2026-07-31T04:42:33.7941559Z test api::reporting::tests::session_end_erase_reaps_stale_worker_then_proceeds ... ok
2026-07-31T04:42:33.8863887Z test api::reporting::tests::session_end_erase_refused_with_live_children ... ok
2026-07-31T04:42:33.9282343Z test api::reporting::tests::session_end_erase_wipes_childless_perch ... ok
2026-07-31T04:42:33.9283571Z test api::startup::tests::fresh_bind_over_dead_life_needs_both_terminal_and_a_new_session ... ok
2026-07-31T04:42:33.9716080Z test api::reporting::tests::session_end_soft_preserves_state ... ok
2026-07-31T04:42:34.0342022Z test api::reporting::tests::soft_end_preserves_a_live_listeners_address ... ok
2026-07-31T04:42:34.0343223Z test api::startup::tests::listen_never_asserts_hosting_topology_and_bind_still_does ... ok
2026-07-31T04:42:34.0344429Z test api::startup::tests::listen_online_gate_refuses_capability_only_online ... ok
2026-07-31T04:42:34.0346011Z test api::startup::tests::listen_orphan_exit_line_names_self_and_parent ... ok
2026-07-31T04:42:34.1013517Z test api::reporting::tests::soft_end_still_cleans_a_dead_listeners_address ... ok
2026-07-31T04:42:34.3432111Z test api::startup::tests::a_listener_over_a_dead_pty_is_not_offlined_by_the_liveness_reconcile ... ok
2026-07-31T04:42:34.4276773Z test api::startup::tests::bind_assigns_home_and_revive_preserves_it ... ok
2026-07-31T04:42:34.5252927Z test api::startup::tests::bind_gateway_earns_no_online_stamp ... ok
2026-07-31T04:42:34.6126288Z test api::startup::tests::parent_watchdog_triggers_exit_on_a_dead_parent_only ... ok
2026-07-31T04:42:35.0232609Z test api::startup::tests::bind_listen_control_detach_keeps_the_earned_hosting_authority ... ok
2026-07-31T04:42:35.0234460Z test api::startup::tests::read_env_measured_capture_replaces_prior_stamp ... ok
2026-07-31T04:42:35.1093999Z test api::startup::tests::bind_live_agent_over_prior_ready_agent_earns_online_on_controllable_with_preserved_type ... ok
2026-07-31T04:42:35.2380179Z test api::startup::tests::bind_records_cwd_so_picker_can_group_by_project ... ok
2026-07-31T04:42:35.2495195Z test api::startup::tests::bind_refuses_a_session_id_that_squats_a_psyche_custody_sid ... ok
2026-07-31T04:42:35.3475691Z test api::startup::tests::bind_with_type_establishes_a_gateway_endpoint ... ok
2026-07-31T04:42:35.3476698Z test api::startup::tests::seed_fail_eof_gives_actionable_stale_broker_hint ... ok
2026-07-31T04:42:35.3478216Z test api::startup::tests::seed_restorable_spends_dead_seeds_restores_recoverable ... ok
2026-07-31T04:42:35.3668956Z test api::startup::tests::bind_with_unrelated_sid_is_unaffected_by_the_squat_guard ... ok
2026-07-31T04:42:35.3705423Z test api::startup::tests::empty_session_seed_refusal_spends_the_seed_no_restore ... ok
2026-07-31T04:42:35.3767062Z test api::startup::tests::empty_session_seed_refused ... ok
2026-07-31T04:42:35.4993020Z test api::startup::tests::establish_stamps_controllable_by_hosting_mode ... ok
2026-07-31T04:42:35.6251469Z test api::startup::tests::fresh_create_over_a_stopped_life_reads_active_with_no_wake ... ok
2026-07-31T04:42:35.7042596Z test api::startup::tests::fresh_create_with_no_prior_carries_no_rest_state ... ok
2026-07-31T04:42:35.7043873Z test api::startup::tests::the_pid_role_is_stamped_from_the_entry_path ... ok
2026-07-31T04:42:35.7256034Z test api::startup::tests::live_perch_under_other_session_conflicts ... ok
2026-07-31T04:42:35.7279298Z test api::tests::adapter_is_optional ... ok
2026-07-31T04:42:35.7300241Z test api::startup::tests::missing_seed_refused ... ok
2026-07-31T04:42:35.7582515Z test api::startup::tests::no_seed_is_the_fallback_trigger_then_sid_binds ... ok
2026-07-31T04:42:35.8565775Z test api::startup::tests::post_spawn_bind_establishes_perch ... ok
2026-07-31T04:42:35.8809456Z test api::startup::tests::prebind_refusal_restores_the_seed_for_retry ... ok
2026-07-31T04:42:35.8820658Z test api::tests::state_value_is_validated ... ok
2026-07-31T04:42:35.8904536Z test api::tests::surface_parses ... ok
2026-07-31T04:42:35.9717371Z test api::startup::tests::rebind_same_session_ok ... ok
2026-07-31T04:42:36.0732461Z test api::startup::tests::revive_preserves_prior_rest_state_and_dormant_anchor ... ok
2026-07-31T04:42:36.1669939Z test api::startup::tests::revive_without_cwd_preserves_prior_cwd ... ok
2026-07-31T04:42:36.1884041Z test api::startup::tests::seed_bind_records_seed_captured_cwd ... ok
2026-07-31T04:42:36.2035218Z test api::startup::tests::session_id_fallback_binds_live_perch_from_sid ... ok
2026-07-31T04:42:36.2212349Z test api::startup::tests::session_id_fallback_refuses_empty_sid_and_dead_anchor ... ok
2026-07-31T04:42:36.2217492Z test api::startup::tests::session_id_fallback_refuses_a_psyche_custody_sid ... ok
2026-07-31T04:42:36.2226809Z test cli::resume_resolution_tests::resume_never_feeds_a_provisional ... ok
2026-07-31T04:42:36.2228376Z test cli::run_home_tests::order_by_mru_orders_guidance ... ok
2026-07-31T04:42:36.2230134Z test cli::run_home_tests::run_home_resolution_matrix ... ok
2026-07-31T04:42:36.2231782Z test cli::run_on_live_tests::run_on_live_never_duplicates_and_create_conflicts ... ok
2026-07-31T04:42:36.2233428Z test cli::run_target_tests::resolve_run_target_quadrants ... ok
2026-07-31T04:42:36.2285958Z test api::startup::tests::stale_seed_refusal_spends_the_seed_no_restore ... ok
2026-07-31T04:42:36.2288233Z test cli::tests::a_status_row_reads_held_over_running_and_carries_its_evidence ... ok
2026-07-31T04:42:36.2351139Z test api::startup::tests::stale_seed_with_dead_anchor_refused ... ok
2026-07-31T04:42:36.2400684Z test cli::tests::adapter_add_transport_flags_parse ... ok
2026-07-31T04:42:36.2404196Z test cli::tests::access_subcommands_parse ... ok
2026-07-31T04:42:36.2630202Z test api::startup::tests::successful_bind_consumes_the_seed_exactly_once ... ok
2026-07-31T04:42:36.2746825Z test cli::tests::a_local_hit_never_asks_the_broker ... ok
2026-07-31T04:42:36.2852428Z test api::startup::tests::valid_seed_binds_live_perch ... ok
2026-07-31T04:42:36.2854089Z test cli::tests::adapter_name_validation_flags_every_unknown ... ok
2026-07-31T04:42:36.2856095Z test cli::tests::adapter_names_comma_list_parses_and_refuses_empties ... ok
2026-07-31T04:42:36.2909311Z test api::tests::ctx_manifest_override_wins_when_manifest_present ... ok
2026-07-31T04:42:36.3008836Z test api::tests::ctx_manifest_unregistered_no_manifest_is_none_not_fatal ... ok
2026-07-31T04:42:36.3017145Z test api::tests::ctx_manifest_resolves_from_registry_when_manifest_absent ... ok
2026-07-31T04:42:36.3041723Z test api::tests::load_manifest_resolves_composite_adapter_option ... ok
2026-07-31T04:42:36.3078494Z test cli::tests::adapter_translate_proof_parses ... ok
2026-07-31T04:42:36.3080373Z test cli::tests::adapter_update_install_dir_is_registered_source_dir_not_repo_name ... ok
2026-07-31T04:42:36.3085252Z test cli::tests::adapter_update_notice_absent_when_no_message ... ok
2026-07-31T04:42:36.3089982Z test cli::tests::adapter_update_notice_renders_declared_message_markdown ... ok
2026-07-31T04:42:36.3090766Z test cli::tests::adapter_update_summary_and_exit_aggregate_isolated_failures ... ok
2026-07-31T04:42:36.3138400Z test cli::tests::adapter_subcommands_parse ... ok
2026-07-31T04:42:36.3155099Z test cli::tests::adapter_version_parses ... ok
2026-07-31T04:42:36.3435116Z test api::worker::tests::cascade_guard_tracks_live_children ... ok
2026-07-31T04:42:36.3436905Z test cli::tests::all_hidden_this_node_suppresses_no_perches_marker ... ok
2026-07-31T04:42:36.3438438Z test cli::tests::already_applied_message_reads_up_to_date_no_restart ... ok
2026-07-31T04:42:36.4130100Z test api::worker::tests::guard_clears_only_when_all_children_stopped ... ok
2026-07-31T04:42:36.4131365Z test cli::tests::any_single_evidence_source_is_enough_and_only_nothing_refuses ... ok
2026-07-31T04:42:36.4161063Z test cli::tests::api_adapter_flag_is_group_level_not_post_subcommand ... ok
2026-07-31T04:42:36.4194187Z test cli::tests::api_listen_accepts_session_id_flag ... ok
2026-07-31T04:42:36.4197383Z test cli::tests::applied_message_appends_restart_required_notice ... ok
2026-07-31T04:42:36.4201061Z test cli::tests::applied_message_renders_semver_or_counter_fallback_and_states_applied ... ok
2026-07-31T04:42:36.6038866Z test api::worker::tests::worker_poll_drains_spool ... ok
2026-07-31T04:42:36.7179378Z test cli::tests::apply_release_crc_swap_only_swaps_changed ... ok
2026-07-31T04:42:36.7207759Z test cli::tests::bare_spt_parses_to_none ... ok
2026-07-31T04:42:36.7208999Z test cli::tests::bare_tty_guard ... ok
2026-07-31T04:42:36.7275198Z test cli::tests::bare_update_parses_composite_flags ... ok
2026-07-31T04:42:36.7275977Z test cli::tests::broker_image_line_reports_without_warning_or_remedy ... ok
2026-07-31T04:42:36.7277564Z test cli::tests::classify_fetch_reject_matrix ... ok
2026-07-31T04:42:36.7279128Z test cli::tests::classify_flat_archive_never_misfires ... ok
2026-07-31T04:42:36.7280871Z test cli::tests::classify_multiplatform_captures_only_known_triples ... ok
2026-07-31T04:42:36.7282462Z test cli::tests::cli_send_stamps_cli_at_node_origin ... ok
2026-07-31T04:42:36.7284706Z test cli::tests::composite_plans_core_first_and_core_only_skips_adapters ... ok
2026-07-31T04:42:36.7287555Z test cli::tests::connection_lines_net_less_hides_stale_heartbeat ... ok
2026-07-31T04:42:36.7289290Z test cli::tests::coordinator_image_line_is_the_only_stale_warning ... ok
2026-07-31T04:42:36.7297535Z test cli::tests::create_existing_name_is_usage_error ... ok
2026-07-31T04:42:36.7306308Z test cli::tests::create_mints_two_distinct_keys_and_records_the_mode ... ok
2026-07-31T04:42:36.7308752Z test cli::tests::create_mode_is_never_preselected ... ok
2026-07-31T04:42:36.7314849Z test cli::tests::create_new_existing_name_is_usage_error ... ok
2026-07-31T04:42:36.7435798Z test cli::tests::create_new_mints_shows_and_requests_save ... ok
2026-07-31T04:42:36.7441150Z test cli::tests::create_not_elevated_refuses_without_saving ... ok
2026-07-31T04:42:36.7611990Z test cli::tests::create_prints_joining_material_when_elevated ... ok
2026-07-31T04:42:36.7963176Z test api::worker::tests::worker_poll_holds_deferred_while_resting ... ok
2026-07-31T04:42:36.7965148Z test cli::tests::cross_node_after_filters_a_sealed_turn_exactly_like_the_local_path ... ok
2026-07-31T04:42:36.7966743Z test cli::tests::daemon_offline_hint_only_when_down ... ok
2026-07-31T04:42:36.7981201Z test cli::tests::daemon_refresh_verb_parses ... ok
2026-07-31T04:42:36.8030528Z test cli::tests::create_provisions_the_admin_key_and_show_code_never_does ... ok
2026-07-31T04:42:36.8032452Z test cli::tests::daemonless_apply_message_points_at_finish_or_start ... ok
2026-07-31T04:42:36.8033818Z test cli::tests::deferred_elevation_gate_matrix ... ok
2026-07-31T04:42:36.8053648Z test cli::tests::digest_cursor_flags_parse ... ok
2026-07-31T04:42:36.8073810Z test cli::tests::digest_flag_defaults ... ok
2026-07-31T04:42:36.8075762Z test cli::tests::digest_human_path_keeps_the_stderr_trailer ... ok
2026-07-31T04:42:36.8078139Z test cli::tests::daemon_subcommands_parse ... ok
2026-07-31T04:42:36.8079066Z test cli::tests::digest_json_carries_version_and_leaves_stderr_clean ... ok
2026-07-31T04:42:36.8080510Z test cli::tests::digest_json_predates_path_still_carries_version ... ok
2026-07-31T04:42:36.8080956Z test cli::tests::empty_store_no_flag_guides_to_pair_or_create ... ok
2026-07-31T04:42:36.8111450Z test cli::tests::endpoint_role_parses ... ok
2026-07-31T04:42:36.8113227Z test cli::tests::endpoint_row_json_endpoint_type_is_additive ... ok
2026-07-31T04:42:36.8599039Z test api::worker::tests::worker_start_mints_id_stores_parent_sid_and_metadata ... ok
2026-07-31T04:42:36.8718352Z test cli::tests::endpoint_subcommands_parse ... ok
2026-07-31T04:42:36.8719684Z test cli::tests::engine_room_ceremony_decision_table ... ok
2026-07-31T04:42:36.8721032Z test cli::tests::engine_room_purge_resets_under_elevation_and_refuses_without_it ... ok
2026-07-31T04:42:36.8722341Z test cli::tests::escalation_choice_parses_fail_closed ... ok
2026-07-31T04:42:36.8820130Z test cli::tests::every_read_status_command_emits_valid_json ... ok
2026-07-31T04:42:36.9006235Z test api::worker::tests::worker_start_nests_under_parent ... ok
2026-07-31T04:42:36.9424802Z test api::worker::tests::worker_start_registration_sid_falls_back_to_presented ... ok
2026-07-31T04:42:37.0061588Z test cli::tests::extract_legacy_flat_stays_flat ... ok
2026-07-31T04:42:37.0065709Z test cli::tests::fetch_reject_action_apply_decision ... ok
2026-07-31T04:42:37.0067349Z test cli::tests::filter_after_excludes_at_or_below_cursor ... ok
2026-07-31T04:42:37.0074603Z test cli::tests::filter_after_predates_window_returns_full ... ok
2026-07-31T04:42:37.0075109Z test cli::tests::finish_message_states_fully_live_no_manual_restart ... ok
2026-07-31T04:42:37.0203314Z test cli::tests::extract_multiplatform_missing_my_triple_is_typed_rejection ... ok
2026-07-31T04:42:37.0204792Z test cli::tests::gh_download_command_no_tag_omits_tag ... ok
2026-07-31T04:42:37.0205864Z test cli::tests::gh_download_command_with_tag_shape ... ok
2026-07-31T04:42:37.0208387Z test cli::tests::gh_failure_classes_render_os_correct_hints ... ok
2026-07-31T04:42:37.0210387Z test cli::tests::gh_release_version_compare_decision ... ok
2026-07-31T04:42:37.0211781Z test cli::tests::gh_version_command_shape ... ok
2026-07-31T04:42:37.0258004Z test cli::tests::grant_subcommands_parse ... ok
2026-07-31T04:42:37.0284997Z test cli::tests::extract_multiplatform_places_shared_root_and_flattens_my_triple ... ok
2026-07-31T04:42:37.0301309Z test cli::tests::help_groups_cover_every_command ... ok
2026-07-31T04:42:37.0347495Z test cli::tests::how_to_topics_cover_ready_and_send ... ok
2026-07-31T04:42:37.0425191Z test cli::tests::hot_path_flat_and_moved_verbs_gone ... ok
2026-07-31T04:42:37.0426687Z test cli::tests::install_platform_check_gates_stamp_and_host_arch ... ok
2026-07-31T04:42:37.0429131Z test cli::tests::instance_rows_palette_and_align ... ok
2026-07-31T04:42:37.0432197Z test cli::tests::instance_rows_project_column ... ok
2026-07-31T04:42:37.0439193Z test cli::tests::install_place_is_idempotent_and_path_block_detected ... ok
2026-07-31T04:42:37.0440604Z test cli::tests::join_gate_refuses_without_confirmed_elevation ... ok
2026-07-31T04:42:37.0442818Z test cli::tests::json_activity_key_is_local_only_and_skips_when_unknown ... ok
2026-07-31T04:42:37.0454602Z test cli::tests::json_activity_words_come_from_the_shared_vocabulary_source ... ok
2026-07-31T04:42:37.0457669Z test cli::tests::invalid_usage_errors ... ok
2026-07-31T04:42:37.0459148Z test cli::tests::json_project_field_skip_if_none ... ok
2026-07-31T04:42:37.0571975Z test cli::tests::multi_subnet_refuses_without_flag_then_resolves_with_it ... ok
2026-07-31T04:42:37.0573948Z test cli::tests::node_group_discards_self_and_skips_empty ... ok
2026-07-31T04:42:37.0575715Z test cli::tests::node_group_freshest_epoch_wins_and_unions_subnets ... ok
2026-07-31T04:42:37.0577400Z test cli::tests::node_group_same_id_two_nodes_two_groups ... ok
2026-07-31T04:42:37.0579417Z test cli::tests::node_grouped_render_structure_and_palette ... ok
2026-07-31T04:42:37.0581826Z test cli::tests::node_level_label_names_an_endpointless_peer ... ok
2026-07-31T04:42:37.0583914Z test cli::tests::node_rows_disambiguate_only_on_label_collision ... ok
2026-07-31T04:42:37.0585606Z test cli::tests::node_status_rows_denominator_counts_routable_only ... ok
2026-07-31T04:42:37.0587610Z test cli::tests::node_status_rows_settle_cheap_signals_probe_only_stale ... ok
2026-07-31T04:42:37.0591168Z test cli::tests::not_elevated_refuses_without_leaking_code_or_saving ... ok
2026-07-31T04:42:37.0596718Z test cli::tests::notify_subnet_resolution_home_default ... ok
2026-07-31T04:42:37.0646402Z test cli::tests::notify_surface_parses ... ok
2026-07-31T04:42:37.0647796Z test cli::tests::origin_asset_urls_latest_and_tag ... ok
2026-07-31T04:42:37.3915303Z test cli::tests::adapter_digest_proof_fills_session_id_key ... ok
2026-07-31T04:42:37.3934892Z test cli::tests::pair_namespace_is_gone ... ok
2026-07-31T04:42:37.3937262Z test cli::tests::peer_health_line_names_the_stage_and_stays_silent_when_idle ... ok
2026-07-31T04:42:37.3938713Z test cli::tests::poll_until_ready_fastpath_timeout_and_later_success ... ok
2026-07-31T04:42:37.3940122Z test cli::tests::post_step_notice_arbitration ... ok
2026-07-31T04:42:37.3969048Z test cli::tests::probe_all_cap_batches_into_windows ... ok
2026-07-31T04:42:37.5987783Z test cli::tests::probe_all_runs_concurrently_in_input_order ... ok
2026-07-31T04:42:37.7539557Z test cli::tests::probe_all_timeout_settles_false_without_stalling_batch ... ok
2026-07-31T04:42:37.7541483Z test cli::tests::project_index_line_states_health_not_presence ... ok
2026-07-31T04:42:37.7543210Z test cli::tests::prune_candidates_resolve_never_guess ... ok
2026-07-31T04:42:37.8745579Z test cli::tests::adapter_digest_proof_gates_on_drops ... ok
2026-07-31T04:42:37.9045871Z test cli::tests::adapter_has_live_endpoint_detects_matching_live_perch ... ok
2026-07-31T04:42:37.9627218Z test cli::tests::adapter_has_live_endpoint_false_for_other_or_dead ... ok
2026-07-31T04:42:37.9789861Z test cli::tests::registered_github_home_detects_active_collision ... ok
2026-07-31T04:42:37.9927445Z test cli::tests::adapter_profile_verbs_local_only ... ok
2026-07-31T04:42:37.9929359Z test cli::tests::remote_cell_project_ref_from_gossiped_recent_projects ... ok
2026-07-31T04:42:38.0202080Z test cli::tests::adapter_string_verbs ... ok
2026-07-31T04:42:38.0203129Z test cli::tests::resolve_transport_auto_follows_probe ... ok
2026-07-31T04:42:38.0204392Z test cli::tests::resolve_transport_explicit_never_probes ... ok
2026-07-31T04:42:38.0206061Z test cli::tests::rest_filter_hides_suspended_shows_all_and_corrupt_always ... ok
2026-07-31T04:42:38.0207657Z test cli::tests::rest_filter_status_first_ordering ... ok
2026-07-31T04:42:38.0209235Z test cli::tests::rest_filter_total_disclosure_and_corrupt_annotation ... ok
2026-07-31T04:42:38.0210604Z test cli::tests::restart_plans_lethal_leg_last ... ok
2026-07-31T04:42:38.0223675Z test cli::tests::ring_timeout_defaults ... ok
2026-07-31T04:42:38.0764214Z test cli::tests::run_bounded_yields_value_or_timeout_default ... ok
2026-07-31T04:42:38.0765598Z test cli::tests::self_pin_annotates_psyche_host_failure ... ok
2026-07-31T04:42:38.0767136Z test cli::tests::self_pin_annotates_translation_fault ... ok
2026-07-31T04:42:38.0769093Z test cli::tests::self_pin_includes_description_when_present ... ok
2026-07-31T04:42:38.0796195Z test cli::tests::send_reply_to_flag_is_removed_and_target_required ... ok
2026-07-31T04:42:38.0815102Z test cli::tests::send_user_msg_flag_parses ... ok
2026-07-31T04:42:40.0571847Z test cli::tests::release_archive_extracts_to_a_registrable_root ... ok
2026-07-31T04:42:46.7334203Z test cli::tests::adapter_use_sets_and_clears_pointer ... ok
2026-07-31T04:42:46.7755133Z test cli::tests::adapter_translate_proof_gates_on_commit ... ok
2026-07-31T04:42:46.8030713Z test cli::tests::adapter_version_surfaces_declared_adapter_version ... ok
2026-07-31T04:42:50.0961521Z test cli::tests::an_engine_room_reset_wipes_records_but_never_deletes_the_engine_room ... ok
2026-07-31T04:42:50.1242311Z test cli::tests::apply_user_msg_gate_local_origination ... ok
2026-07-31T04:42:50.2105014Z test cli::tests::shell_spawn_profiled_option_resolves_and_shares_cap ... ok
2026-07-31T04:42:50.2321672Z test cli::tests::shell_subcommands_parse ... ok
2026-07-31T04:42:50.2420772Z test cli::tests::show_code_prints_reprovisioning_material ... ok
2026-07-31T04:42:50.3811596Z test cli::tests::endpoint_stop_marks_offline ... ok
2026-07-31T04:43:04.7800256Z test cli::tests::json_payload_rides_as_attr_alongside_body ... ok
2026-07-31T04:43:05.8698976Z test cli::tests::fork_forks_homes_and_deletes_exactly_the_source ... ok
2026-07-31T04:43:05.8904653Z test cli::tests::single_subnet_auto_selects_and_code_matches_seed ... ok
2026-07-31T04:43:25.0791860Z test cli::tests::owner_shutdown_gated_by_can_shutdown_grant ... ok
2026-07-31T04:43:27.2007153Z test cli::tests::stage_then_swap_failed_fetch_preserves_install ... ok
2026-07-31T04:43:27.3081327Z test cli::tests::staged_floor_admits_when_core_meets_floor ... ok
2026-07-31T04:43:27.5501772Z test cli::tests::staged_floor_refuses_above_floor_and_leaves_dest_untouched ... ok
2026-07-31T04:43:27.5502777Z test cli::tests::stall_evict_line_surfaces_only_a_real_tally ... ok
2026-07-31T04:43:27.5504528Z test cli::tests::stop_guard_refuses_live_sessions_without_force ... ok
2026-07-31T04:43:27.5613688Z test cli::tests::subcommands_parse ... ok
2026-07-31T04:43:27.5769443Z test cli::tests::subnet_arg_shapes_parse ... ok
2026-07-31T04:43:27.5771144Z test cli::tests::subnet_mode_lines_state_declared_captured_and_pending ... ok
2026-07-31T04:43:27.5776889Z test cli::tests::subnet_status_renders_rows_and_hints_never_secrets ... ok
2026-07-31T04:43:27.5778319Z test cli::tests::subnets_joined_banner_renders_rows_and_divider ... ok
2026-07-31T04:43:27.5779718Z test cli::tests::subprocess_detail_prefers_stderr_then_stdout ... ok
2026-07-31T04:43:27.6433931Z test cli::tests::purge_force_asks_before_it_tears_anything_down ... ok
2026-07-31T04:43:27.6435762Z test cli::tests::this_node_group_merges_roster_with_unbound_truth ... ok
2026-07-31T04:43:27.6437284Z test cli::tests::trust_mutation_gate_refuses_without_confirmed_elevation ... ok
2026-07-31T04:43:27.6440916Z test cli::tests::unknown_elevation_falls_back ... ok
2026-07-31T04:43:27.6445183Z test cli::tests::unknown_named_subnet_is_usage_error ... ok
2026-07-31T04:43:27.6466506Z test cli::tests::update_adapters_verb_parses_with_optional_names ... ok
2026-07-31T04:43:27.6488759Z test cli::tests::update_fetch_apply_flag_parses ... ok
2026-07-31T04:43:27.6505436Z test cli::tests::whoami_parses_as_the_identity_verb ... ok
2026-07-31T04:43:27.6507198Z test elevation::tests::already_elevated_short_circuits_on_every_os ... ok
2026-07-31T04:43:27.6508766Z test elevation::tests::current_returns_a_determinate_level_on_supported_platforms ... ok
2026-07-31T04:43:27.6510418Z test elevation::tests::fallback_message_names_authenticator_app_and_subnet ... ok
2026-07-31T04:43:27.6511837Z test elevation::tests::gate_shows_only_when_confirmed_elevated ... ok
2026-07-31T04:43:27.6513602Z test elevation::tests::launcher_argv_is_absolute_exe_plus_verbatim_args ... ok
2026-07-31T04:43:27.6515578Z test elevation::tests::launchers_never_shell_interpolate_a_crafted_arg ... ok
2026-07-31T04:43:27.6517300Z test elevation::tests::print_hint_floor_uses_absolute_path_each_os ... ok
2026-07-31T04:43:27.6518663Z test elevation::tests::unix_path_order_tty_then_pkexec_then_terminal_then_hint ... ok
2026-07-31T04:43:27.6519960Z test elevation::tests::windows_uac_only_interactive_other_always_prints ... ok
2026-07-31T04:43:27.6521643Z test helpfmt::tests::atx_header_at_line_start_strips_and_bolds ... ok
2026-07-31T04:43:27.6522962Z test helpfmt::tests::bold_styles_with_color_and_strips_without ... ok
2026-07-31T04:43:27.6524617Z test helpfmt::tests::code_styles_with_color_and_strips_without ... ok
2026-07-31T04:43:27.6526073Z test helpfmt::tests::color_enabled_truth_table ... ok
2026-07-31T04:43:27.6527643Z test helpfmt::tests::dual_contract_token_survives_strip_mode ... ok
2026-07-31T04:43:27.6529133Z test helpfmt::tests::dual_contract_token_unstyled_while_prose_styles_on_color ... ok
2026-07-31T04:43:27.6530340Z test helpfmt::tests::empty_and_unmatched_markers_stay_literal ... ok
2026-07-31T04:43:27.6531889Z test helpfmt::tests::link_becomes_its_text ... ok
2026-07-31T04:43:27.6533245Z test helpfmt::tests::marker_never_spans_a_hard_break ... ok
2026-07-31T04:43:27.6534504Z test helpfmt::tests::marker_spans_a_clap_soft_wrap ... ok
2026-07-31T04:43:27.6536033Z test helpfmt::tests::multibyte_text_survives ... ok
2026-07-31T04:43:27.6537197Z test helpfmt::tests::nested_code_inside_bold_styles_both ... ok
2026-07-31T04:43:27.6538953Z test helpfmt::tests::plain_text_is_unchanged ... ok
2026-07-31T04:43:27.6540195Z test helpfmt::tests::preexisting_ansi_is_passed_through_untouched ... ok
2026-07-31T04:43:27.6541717Z test helpfmt::tests::resolve_console_color_strips_when_vt_unavailable ... ok
2026-07-31T04:43:27.6543665Z test picker::data::tests::disambiguate_project_ids_cases ... ok
2026-07-31T04:43:27.6545732Z test picker::data::tests::driven_by_display_renders_name_not_hex ... ok
2026-07-31T04:43:27.6555175Z test cli::tests::the_evidence_census_reads_each_local_source ... ok
2026-07-31T04:43:27.6608009Z test cli::tests::purge_offline_gate_and_self_guard ... ok
2026-07-31T04:43:34.1201934Z test cli::tests::resolve_proof_target_override_reads_on_disk ... ok
2026-07-31T04:43:34.1203960Z test picker::data::tests::indexed_projection_full_w2shaped_and_absent_legs ... ok
2026-07-31T04:43:34.1205625Z test picker::data::tests::non_drivable_predicate_covers_worker_and_psyche ... ok
2026-07-31T04:43:34.1280586Z test cli::tests::purge_removes_every_record ... ok
2026-07-31T04:43:34.5996075Z test cli::tests::shell_channels_relay_sensory_and_text_file ... ok
2026-07-31T04:43:34.5998976Z test picker::data::tests::project_refs_from_sessions_excludes_owlery_and_dedups_newest_first ... ok
2026-07-31T04:43:34.6002004Z test picker::data::tests::project_refs_from_unions_fresh_origin_and_store_branches ... ok
2026-07-31T04:43:34.6004108Z test picker::data::tests::reconcile_overrides_subnet_with_local_roster ... ok
2026-07-31T04:43:34.6489289Z test cli::tests::shell_owner_exclusivity_negatives ... ok
2026-07-31T04:43:34.7748711Z test cli::tests::shell_relink_relaunches_offline_instances_only ... ok
2026-07-31T04:43:34.7750523Z test picker::data::tests::resume_rows_derive_per_row_project_and_drop_owlery_sessions ... ok
2026-07-31T04:43:35.0424868Z test cli::tests::shell_spawn_approval_floor_gates ... ok
2026-07-31T04:43:35.0426341Z test picker::data::tests::row_status_drives_unbound_display ... ok
2026-07-31T04:43:35.3056127Z test cli::tests::shell_spawn_cap_and_over_cap_gates ... ok
2026-07-31T04:43:35.3062727Z test picker::model::tests::adapter_tree_nests_profiles ... ok
2026-07-31T04:43:35.3067866Z test picker::model::tests::back_unwinds ... ok
2026-07-31T04:43:35.3071853Z test picker::model::tests::build_project_choices_head_here_rest ... ok
2026-07-31T04:43:35.3073338Z test picker::model::tests::category_labels_render_display_forms ... ok
2026-07-31T04:43:35.3074798Z test picker::model::tests::category_ring_wraps ... ok
2026-07-31T04:43:35.3076995Z test picker::model::tests::change_adapter_picks_and_returns_to_confirm ... ok
2026-07-31T04:43:35.3079137Z test picker::model::tests::choose_project_outcome_bakes_cwd_and_diverts ... ok
2026-07-31T04:43:35.3080717Z test picker::model::tests::confirm_local_offline_unchanged_by_wake_split ... ok
2026-07-31T04:43:35.3082293Z test picker::model::tests::confirm_options_remote_suspended_is_wake_not_start ... ok
2026-07-31T04:43:35.3083948Z test picker::model::tests::confirm_options_status_dependent ... ok
2026-07-31T04:43:35.3086024Z test picker::model::tests::confirm_terminal_routes ... ok
2026-07-31T04:43:35.3087806Z test picker::model::tests::confirm_terminal_wake_carries_raw_node ... ok
2026-07-31T04:43:35.3089513Z test picker::model::tests::create_new_multisubnet_inserts_home_layer ... ok
2026-07-31T04:43:35.3091184Z test picker::model::tests::create_outcome_bakes_run ... ok
2026-07-31T04:43:35.3092426Z test picker::model::tests::cursor_clamps ... ok
2026-07-31T04:43:35.3093810Z test picker::model::tests::display_mapping_matrix ... ok
2026-07-31T04:43:35.3095283Z test picker::model::tests::display_status_four_state_type_gated ... ok
2026-07-31T04:43:35.3096600Z test picker::model::tests::display_status_unbound_is_hollow_and_attachable ... ok
2026-07-31T04:43:35.3098041Z test picker::model::tests::empty_scope_opens_create ... ok
2026-07-31T04:43:35.3099375Z test picker::model::tests::ep_display_glyph_and_square_palette ... ok
2026-07-31T04:43:35.3100667Z test picker::model::tests::esc_backs_out_of_home_layer ... ok
2026-07-31T04:43:35.3103343Z test picker::model::tests::filter_narrows ... ok
2026-07-31T04:43:35.3104986Z test picker::model::tests::from_resource_row_maps_gossiped_adapter_projects_controlled ... ok
2026-07-31T04:43:35.3106309Z test picker::model::tests::home_selection_bakes_into_run_subnet ... ok
2026-07-31T04:43:35.3107429Z test picker::model::tests::kind_routes ... ok
2026-07-31T04:43:35.3109134Z test picker::model::tests::launch_keys_live_only_on_launch_capable_highlights ... ok
2026-07-31T04:43:35.3110267Z test picker::model::tests::prefill_jumps_to_create ... ok
2026-07-31T04:43:35.3111774Z test picker::model::tests::project_filter_keys_on_slug_while_tab_renders_display ... ok
2026-07-31T04:43:35.3113192Z test picker::model::tests::purge_confirm_yields_outcome_and_backs_out ... ok
2026-07-31T04:43:35.3114967Z test picker::model::tests::purge_shortcut_gates_to_offline_local ... ok
2026-07-31T04:43:35.3116868Z test picker::model::tests::reenter_create_keeps_or_clears_id ... ok
2026-07-31T04:43:35.3118297Z test picker::model::tests::remove_endpoint_drops_row_and_clamps_cursor ... ok
2026-07-31T04:43:35.3119663Z test picker::model::tests::resume_outcome_adapter_follows_recorded_row ... ok
2026-07-31T04:43:35.3121456Z test picker::model::tests::resume_outcome_bakes_session ... ok
2026-07-31T04:43:35.3124306Z test picker::model::tests::resume_title_render ... ok
2026-07-31T04:43:35.3125718Z test picker::model::tests::should_offer_project_choice_fire_conditions ... ok
2026-07-31T04:43:35.3126879Z test picker::model::tests::single_subnet_skips_home_layer ... ok
2026-07-31T04:43:35.3127968Z test picker::model::tests::suspended_is_distinct_from_offline ... ok
2026-07-31T04:43:35.3129387Z test picker::model::tests::visible_partitions_and_sorts ... ok
2026-07-31T04:43:35.3131155Z test picker::shortcut::tests::bakes_create_attach_by_default ... ok
2026-07-31T04:43:35.3132729Z test picker::shortcut::tests::bakes_resume_and_action ... ok
2026-07-31T04:43:35.3134119Z test picker::shortcut::tests::basename_is_parameterized ... ok
2026-07-31T04:43:35.3135443Z test picker::shortcut::tests::sentinel_detection ... ok
2026-07-31T04:43:35.3472793Z test picker::shortcut::tests::write_create_update_refuse ... ok
2026-07-31T04:43:35.3474329Z test picker::tests::backspace_backs_out_screens_like_esc ... ok
2026-07-31T04:43:35.3475827Z test picker::tests::backspace_stays_char_delete_in_text_contexts ... ok
2026-07-31T04:43:35.3477117Z test picker::tests::purge_outcomes_convert_to_flash_lines ... ok
2026-07-31T04:43:35.3544597Z test picker::tests::purge_transition_reconstructs_the_complete_screen_after_external_mutation ... ok
2026-07-31T04:43:35.3578335Z test picker::view::tests::adapter_tree_buffer ... ok
2026-07-31T04:43:35.3603109Z test picker::view::tests::change_adapter_screen_renders_tree_and_apply_legend ... ok
2026-07-31T04:43:35.3634882Z test picker::view::tests::choose_project_buffer_keeps_confirm_panel ... ok
2026-07-31T04:43:35.3668308Z test picker::view::tests::confirm_buffer_options ... ok
2026-07-31T04:43:35.3703436Z test picker::view::tests::confirm_fork_and_shortcut_labels_are_dir_relative ... ok
2026-07-31T04:43:35.3748271Z test picker::view::tests::confirm_panel_history_renders_display_not_slug ... ok
2026-07-31T04:43:35.3772118Z test picker::view::tests::create_home_lists_subnets ... ok
2026-07-31T04:43:35.3822258Z test picker::view::tests::footer_hints_h_s_only_when_launch_keys_live ... ok
2026-07-31T04:43:35.3845540Z test picker::view::tests::kind_buffer ... ok
2026-07-31T04:43:35.3878382Z test picker::view::tests::pick_buffer_has_squares_and_description ... ok
2026-07-31T04:43:35.3911879Z test picker::view::tests::pick_empty_category_hint ... ok
2026-07-31T04:43:35.4146983Z test picker::view::tests::pick_status_line_four_state ... ok
2026-07-31T04:43:35.4183723Z test picker::view::tests::resume_buffer_keeps_confirm_panel ... ok
2026-07-31T04:43:35.4213378Z test picker::view::tests::resume_buffer_lists_sessions ... ok
2026-07-31T04:43:36.8187070Z test cli::tests::endpoint_role_overwrite_is_the_sole_writer has been running for over 60 seconds
2026-07-31T04:43:46.4320836Z test cli::tests::shell_spawn_gates_on_the_registered_set ... ok
2026-07-31T04:43:46.4322059Z test rc::tests::attach_gate_routes_on_session_truth_not_the_row ... ok
2026-07-31T04:43:50.2448038Z test cli::tests::shutdown_and_stop_share_the_postcondition_and_differ_only_in_ceremony has been running for over 60 seconds
2026-07-31T04:43:50.3878080Z test cli::tests::shutdown_on_a_broker_hosted_endpoint_stamps_after_the_reap has been running for over 60 seconds
2026-07-31T04:43:55.5539616Z test cli::tests::endpoint_role_overwrite_is_the_sole_writer ... ok
2026-07-31T04:43:55.6587018Z test cli::tests::shutdown_and_stop_share_the_postcondition_and_differ_only_in_ceremony ... ok
2026-07-31T04:43:55.6588379Z test rc::tests::bracketed_paste_framing_is_exact_and_content_verbatim ... ok
2026-07-31T04:43:55.6589759Z test rc::tests::broker_host_child ... ok
2026-07-31T04:43:55.6591434Z test rc::tests::canonical_wire_id_strips_qualifiers_to_the_bare_id ... ok
2026-07-31T04:43:55.6592721Z test rc::tests::classify_read_err_eof_is_graceful_not_fatal ... ok
2026-07-31T04:43:55.6594074Z test rc::tests::clipboard_paste_wraps_nonempty_and_noops_on_empty_or_failure ... ok
2026-07-31T04:43:55.6595280Z test rc::tests::detach_keybind_semantics ... ok
2026-07-31T04:43:55.6596603Z test rc::tests::detach_prefix_spans_chunks ... ok
2026-07-31T04:43:55.6597886Z test rc::tests::display_guard_postlude_exactly_once_and_inactive_silent ... ok
2026-07-31T04:43:55.6599252Z test rc::tests::driver_phrase_names_own_node_plainly_but_remote_verbatim ... ok
2026-07-31T04:43:55.7633137Z test cli::tests::shutdown_on_a_broker_hosted_endpoint_stamps_after_the_reap ... ok
2026-07-31T04:43:55.7634048Z test rc::tests::first_event_stall_decision ... ok
2026-07-31T04:43:55.7635473Z test rc::tests::fold_code_key_prompt_rules ... ok
2026-07-31T04:43:55.7637259Z test rc::tests::give_up_copy_names_daemon_down_vs_generic ... ok
2026-07-31T04:43:55.7638768Z test rc::tests::harness_only_row_matches_online_seatless_live_agents_only ... ok
2026-07-31T04:43:55.7640058Z test rc::tests::identity_line_format ... ok
2026-07-31T04:43:55.7641917Z test rc::tests::key_event_step_detach_sm ... ok
2026-07-31T04:43:55.7643420Z test rc::tests::mouse_is_paste_only_right_button_down ... ok
2026-07-31T04:43:55.7645119Z test rc::tests::mouse_mode_decset_scan_survives_split_across_chunks ... ok
2026-07-31T04:43:55.7646657Z test rc::tests::mouse_mode_decset_scan_tracks_enable_and_sgr ... ok
2026-07-31T04:43:55.7650525Z test rc::tests::op_minter_distinct_and_monotonic ... ok
2026-07-31T04:43:55.7651865Z test rc::tests::pre_broker_busy_guidance_fires_for_any_driver_not_just_remote ... ok
2026-07-31T04:43:55.7653431Z test rc::tests::public_attach_failure_maps_deadline_class_only ... ok
2026-07-31T04:43:55.7655156Z test rc::tests::pump_status_emit_sequence_over_write_sink ... ok
2026-07-31T04:43:55.8051105Z test cli::tests::shutdown_on_a_harness_hosted_endpoint_claims_no_process ... ok
2026-07-31T04:43:55.8052641Z test rc::tests::reassert_scanner_survives_split_across_chunks ... ok
2026-07-31T04:43:55.8054240Z test rc::tests::reassert_scanner_triggers_only_on_region_destroyers ... ok
2026-07-31T04:43:55.8055748Z test rc::tests::reconnect_banner_clears_and_centers ... ok
2026-07-31T04:43:55.8057371Z test rc::tests::reconnect_banner_shows_the_countdown ... ok
2026-07-31T04:43:55.8058800Z test rc::tests::reconnect_class_only_severed_transport_redrives ... ok
2026-07-31T04:43:55.8060110Z test rc::tests::reconnect_remaining_secs_counts_down_ceil ... ok
2026-07-31T04:43:55.8061546Z test rc::tests::reconnect_window_expiry_decision ... ok
2026-07-31T04:43:55.8062872Z test rc::tests::scroll_dir_classifies_wheel_only ... ok
2026-07-31T04:43:55.8064038Z test rc::tests::scroll_sgr_emits_exact_xterm_bytes ... ok
2026-07-31T04:43:55.8065128Z test rc::tests::serve_eof_severed_vs_refused ... ok
2026-07-31T04:43:55.8066455Z test rc::tests::status_assert_reserves_row1_then_repaints ... ok
2026-07-31T04:43:55.8067987Z test rc::tests::status_repaint_exact_bytes_and_right_align ... ok
2026-07-31T04:43:55.8069113Z test rc::tests::status_restore_exact_bytes ... ok
2026-07-31T04:43:55.8070442Z test rc::tests::status_row_marker_is_disabled_by_flag ... ok
2026-07-31T04:43:55.8071815Z test rc::tests::status_update_size_repoints_geometry ... ok
2026-07-31T04:43:55.8073538Z test rc::tests::teardown_matrix_postlude_precedes_prose_across_every_final_class ... ok
2026-07-31T04:43:55.8074794Z test rc::tests::the_client_refuses_engine_room_viewports_and_qualified_targets_only ... ok
2026-07-31T04:43:55.8076237Z test rc::tests::translate_key_event_emits_exact_xterm_vt ... ok
2026-07-31T04:43:55.8077314Z test rc::tests::with_vt_output_disables_newline_auto_return ... ok
2026-07-31T04:43:55.8078558Z test rc::tests::with_vt_output_enables_virtual_terminal_processing ... ok
2026-07-31T04:43:55.9523428Z test cli::tests::spt_hosted_no_relay_detection ... ok
2026-07-31T04:43:56.0256706Z test picker::data::tests::gather_endpoints_projects_from_seeded_index_with_zero_git ... ok
2026-07-31T04:43:56.0917889Z test picker::data::tests::gather_renders_live_unbound ... ok
2026-07-31T04:43:56.4490504Z test picker::data::tests::home_subnet_options_is_mru_ordered ... ok
2026-07-31T04:43:56.4684742Z test picker::data::tests::own_node_tab_label_falls_back_to_keyprefix ... ok
2026-07-31T04:43:56.5391336Z test picker::data::tests::picker_excludes_flat_worker_and_psyche ... ok
2026-07-31T04:43:56.5627270Z test picker::data::tests::remote_picker_renders_suspended_dead_perch_offline ... ok
2026-07-31T04:43:56.5628069Z test roster::tests::match_self_by_ancestry_disambiguates_and_none ... ok
2026-07-31T04:43:56.5798226Z test picker::data::tests::remote_rows_render_full_palette_parity ... ok
2026-07-31T04:43:56.5800805Z test teardown::tests::an_unconfirmed_row_over_a_dead_root_is_stale_not_a_survivor ... ok
2026-07-31T04:43:56.6004134Z test picker::data::tests::resume_rows_title_from_index_cwd_map_with_pure_fallback ... ok
2026-07-31T04:43:56.6005062Z test teardown::tests::timeout_refuses_the_stamp_and_names_the_survivor ... ok
2026-07-31T04:43:56.6012028Z test teardown::tests::topology_gate_is_controllable_true_only ... ok
2026-07-31T04:43:56.6012659Z test tests::broken_pipe_panic_classifier ... ok
2026-07-31T04:43:56.6024620Z test wansend::tests::bare_id_resolves_across_remote_snapshot ... ok
2026-07-31T04:43:56.6059542Z test wansend::tests::classify_wan_reply_only_delivers_on_positive_outcomes ... ok
2026-07-31T04:43:56.6209561Z test teardown::tests::liveness_proof_needs_a_real_snapshot_and_finds_this_process ... ok
2026-07-31T04:43:56.6218483Z test wansend::tests::refusals_render_copy_paste_targets ... ok
2026-07-31T04:43:56.6228932Z test picker::data::tests::shared_machine_is_one_group_with_unioned_subnets ... ok
2026-07-31T04:43:56.6229536Z test wansend::tests::load_snapshots_degrades_on_junk ... ok
2026-07-31T04:43:56.6438493Z test rc::tests::attach_against_stopped_daemon_never_spawns_and_exits_loud ... ok
2026-07-31T04:43:56.7007245Z test rc::tests::attach_offline_endpoint_short_circuits_clean ... ok
2026-07-31T04:43:56.7449232Z 
2026-07-31T04:43:56.7449609Z running 1 test
2026-07-31T04:43:56.7878351Z NTP_TOTP_UNCORRECTED: all NTP servers unreachable — ceremony clock = raw system clock
2026-07-31T04:43:56.8367289Z CONN_LIFECYCLE: conn=1 role=brain wall_ms=1785473036836 mono_ms=0 event=transport-close poisoned=false timed_out=false [REQ-CONN-POISON-ATTRIBUTION]
2026-07-31T04:43:56.8368615Z CONN_LIFECYCLE: conn=3 role=brain wall_ms=1785473036836 mono_ms=0 event=write-start [REQ-CONN-POISON-ATTRIBUTION]
2026-07-31T04:43:56.9005067Z CONN_LIFECYCLE: conn=2 role=brain controller session=1 endpoint=reheal by=local wall_ms=1785473036900 mono_ms=63 event=controller-attach session=1 from_seq=0 [REQ-CONN-POISON-ATTRIBUTION]
2026-07-31T04:43:56.9009469Z CONN_LIFECYCLE: conn=2 role=brain controller session=1 endpoint=reheal by=local wall_ms=1785473036900 mono_ms=64 event=write-start [REQ-CONN-POISON-ATTRIBUTION]
2026-07-31T04:43:56.9018053Z CONN_LIFECYCLE: conn=4 role=brain wall_ms=1785473036901 mono_ms=65 event=write-start [REQ-CONN-POISON-ATTRIBUTION]
2026-07-31T04:43:56.9167528Z CONN_LIFECYCLE: conn=4 role=brain stream-subscriber stream=2 wall_ms=1785473036916 mono_ms=79 event=stream-sub-attach stream=2 from_seq=0 [REQ-CONN-POISON-ATTRIBUTION]
2026-07-31T04:43:56.9379155Z CONN_LIFECYCLE: conn=5 role=brain wall_ms=1785473036937 mono_ms=101 event=write-start [REQ-CONN-POISON-ATTRIBUTION]
2026-07-31T04:43:56.9380174Z CONN_LIFECYCLE: conn=5 role=brain wall_ms=1785473036937 mono_ms=101 event=transport-close poisoned=false timed_out=false [REQ-CONN-POISON-ATTRIBUTION]
2026-07-31T04:43:56.9383672Z CONN_LIFECYCLE: conn=6 role=brain wall_ms=1785473036938 mono_ms=101 event=write-start [REQ-CONN-POISON-ATTRIBUTION]
2026-07-31T04:43:56.9386400Z CONN_LIFECYCLE: conn=6 role=brain stream-subscriber stream=1 wall_ms=1785473036938 mono_ms=101 event=stream-sub-attach stream=1 from_seq=0 [REQ-CONN-POISON-ATTRIBUTION]
2026-07-31T04:43:56.9400382Z CONN_LIFECYCLE: conn=6 role=brain stream-subscriber stream=1 viewer session=1 endpoint=reheal vid=0 wall_ms=1785473036939 mono_ms=103 event=viewer-attach session=1 vid=0 from_seq=0 [REQ-CONN-POISON-ATTRIBUTION]
2026-07-31T04:43:56.9404321Z SUBSCRIBE_DECISION: session=1 endpoint=reheal by=fd1724385aa0c75b64fb78cd602fa1d991fdebf76b13c58ed702eac835e9f618 conn=6 intent=viewer old_by=- old_gen=0 req_gen=0 decision=viewer
2026-07-31T04:43:56.9405939Z CONN_LIFECYCLE: conn=6 role=brain stream-subscriber stream=1 viewer session=1 endpoint=reheal vid=0 viewer session=1 endpoint=reheal vid=1 wall_ms=1785473036940 mono_ms=103 event=viewer-attach session=1 vid=1 from_seq=0 [REQ-CONN-POISON-ATTRIBUTION]
2026-07-31T04:43:56.9408963Z SUBSCRIBE_DECISION: session=1 endpoint=reheal by=fd1724385aa0c75b64fb78cd602fa1d991fdebf76b13c58ed702eac835e9f618 conn=6 intent=viewer old_by=- old_gen=0 req_gen=0 decision=viewer
2026-07-31T04:43:56.9754223Z 
2026-07-31T04:43:56.9754543Z running 1 test
2026-07-31T04:43:57.0238902Z NTP_TOTP_UNCORRECTED: all NTP servers unreachable — ceremony clock = raw system clock
2026-07-31T04:43:57.0684425Z CONN_LIFECYCLE: conn=1 role=brain wall_ms=1785473037068 mono_ms=0 event=transport-close poisoned=false timed_out=false [REQ-CONN-POISON-ATTRIBUTION]
2026-07-31T04:43:57.0685908Z CONN_LIFECYCLE: conn=3 role=brain wall_ms=1785473037068 mono_ms=0 event=write-start [REQ-CONN-POISON-ATTRIBUTION]
2026-07-31T04:43:57.1042858Z CONN_LIFECYCLE: conn=2 role=brain controller session=1 endpoint=reheal by=local wall_ms=1785473037104 mono_ms=35 event=controller-attach session=1 from_seq=0 [REQ-CONN-POISON-ATTRIBUTION]
2026-07-31T04:43:57.1053355Z CONN_LIFECYCLE: conn=2 role=brain controller session=1 endpoint=reheal by=local wall_ms=1785473037104 mono_ms=36 event=write-start [REQ-CONN-POISON-ATTRIBUTION]
2026-07-31T04:43:57.9605417Z CONN_LIFECYCLE: conn=4 role=brain wall_ms=1785473037960 mono_ms=891 event=write-start [REQ-CONN-POISON-ATTRIBUTION]
2026-07-31T04:43:57.9738986Z CONN_LIFECYCLE: conn=4 role=brain stream-subscriber stream=2 wall_ms=1785473037973 mono_ms=905 event=stream-sub-attach stream=2 from_seq=0 [REQ-CONN-POISON-ATTRIBUTION]
2026-07-31T04:43:57.9961418Z CONN_LIFECYCLE: conn=5 role=brain wall_ms=1785473037995 mono_ms=927 event=write-start [REQ-CONN-POISON-ATTRIBUTION]
2026-07-31T04:43:57.9962523Z CONN_LIFECYCLE: conn=5 role=brain wall_ms=1785473037996 mono_ms=927 event=transport-close poisoned=false timed_out=false [REQ-CONN-POISON-ATTRIBUTION]
2026-07-31T04:43:57.9966292Z CONN_LIFECYCLE: conn=6 role=brain wall_ms=1785473037996 mono_ms=928 event=write-start [REQ-CONN-POISON-ATTRIBUTION]
2026-07-31T04:43:57.9969243Z CONN_LIFECYCLE: conn=6 role=brain stream-subscriber stream=1 wall_ms=1785473037996 mono_ms=928 event=stream-sub-attach stream=1 from_seq=0 [REQ-CONN-POISON-ATTRIBUTION]
2026-07-31T04:43:57.9972962Z CONN_LIFECYCLE: conn=6 role=brain stream-subscriber stream=1 viewer session=1 endpoint=reheal vid=0 wall_ms=1785473037997 mono_ms=928 event=viewer-attach session=1 vid=0 from_seq=0 [REQ-CONN-POISON-ATTRIBUTION]
2026-07-31T04:43:57.9976066Z SUBSCRIBE_DECISION: session=1 endpoint=reheal by=fd1724385aa0c75b64fb78cd602fa1d991fdebf76b13c58ed702eac835e9f618 conn=6 intent=viewer old_by=- old_gen=0 req_gen=0 decision=viewer
2026-07-31T04:43:57.9977751Z CONN_LIFECYCLE: conn=6 role=brain stream-subscriber stream=1 viewer session=1 endpoint=reheal vid=0 viewer session=1 endpoint=reheal vid=1 wall_ms=1785473037997 mono_ms=929 event=viewer-attach session=1 vid=1 from_seq=0 [REQ-CONN-POISON-ATTRIBUTION]
2026-07-31T04:43:57.9979780Z SUBSCRIBE_DECISION: session=1 endpoint=reheal by=fd1724385aa0c75b64fb78cd602fa1d991fdebf76b13c58ed702eac835e9f618 conn=6 intent=viewer old_by=- old_gen=0 req_gen=0 decision=viewer
2026-07-31T04:43:58.3220997Z CONN_LIFECYCLE: conn=6 role=brain stream-subscriber stream=1 viewer session=1 endpoint=reheal vid=0 viewer session=1 endpoint=reheal vid=1 wall_ms=1785473038321 mono_ms=1253 event=stream-sub-release stream=1 [REQ-CONN-POISON-ATTRIBUTION]
2026-07-31T04:43:58.3222333Z CONN_LIFECYCLE: conn=7 role=brain wall_ms=1785473038321 mono_ms=1253 event=transport-close poisoned=false timed_out=false [REQ-CONN-POISON-ATTRIBUTION]
2026-07-31T04:43:58.3298501Z test rc::tests::attach_viewport_reconnects_across_a_broker_bounce ... ok
2026-07-31T04:44:00.4694956Z test rc::tests::establish_attach_reuses_the_probes_carried_pump_conn ... ok
2026-07-31T04:44:02.5305158Z test rc::tests::qualified_targets_attach_with_bare_wire_id ... ok
2026-07-31T04:44:02.5392498Z test roster::tests::detect_self_by_ancestry_none_when_no_ancestor_owns_a_perch ... ok
2026-07-31T04:44:02.5618940Z test roster::tests::detect_self_by_ancestry_resolves_a_live_ancestor_perch ... ok
2026-07-31T04:44:02.5803956Z test roster::tests::detect_self_id_endpoint_id_leg_is_label_only_and_perch_gated ... ok
2026-07-31T04:44:02.6114466Z test roster::tests::detect_self_id_resolves_identity_with_zero_git_spawns ... ok
2026-07-31T04:44:02.6227140Z test roster::tests::detect_self_resolves_spt_hosted_perch_via_parent_pid ... ok
2026-07-31T04:44:02.6250970Z test roster::tests::enumerate_yields_offline_corrupt_row_for_unparseable_info ... ok
2026-07-31T04:44:02.6464048Z test roster::tests::list_all_perch_dirs_enumerates_nested_psyche_for_self_resolution ... ok
2026-07-31T04:44:02.6659493Z test roster::tests::parent_pid_candidates_stay_ancestry_gated ... ok
2026-07-31T04:44:03.0813202Z test wansend::tests::remote_rest_suspends_and_wakes_with_the_deferred_gate ... ok
2026-07-31T04:44:03.1537623Z test wansend::tests::resolve_and_dial_owner_dials_the_resolved_node ... ok
2026-07-31T04:44:03.2034658Z test wansend::tests::resolve_and_dial_owner_is_honest_on_resolution_misses ... ok
2026-07-31T04:44:03.2147633Z test wansend::tests::seed_first_addr_prefers_the_cached_direct_address ... ok
2026-07-31T04:44:03.4183299Z test wansend::tests::wan_send_ships_to_the_resolved_node ... ok
2026-07-31T04:44:03.4183595Z 
2026-07-31T04:44:03.4183848Z test result: ok. 475 passed; 0 failed; 0 ignored; 0 measured; 0 filtered out; finished in 95.41s
2026-07-31T04:44:03.4184224Z 
2026-07-31T04:44:03.4440022Z      Running unittests tests\fixtures\translate_proof_fixture.rs (target\debug\deps\translate_proof_fixture-6c1f32e3e25e0c2c.exe)
2026-07-31T04:44:03.5370480Z 
2026-07-31T04:44:03.5370838Z running 0 tests
2026-07-31T04:44:03.5370957Z 
2026-07-31T04:44:03.5372599Z test result: ok. 0 passed; 0 failed; 0 ignored; 0 measured; 0 filtered out; finished in 0.00s
2026-07-31T04:44:03.5372957Z 
2026-07-31T04:44:03.5382308Z      Running unittests src\lib.rs (target\debug\deps\spt_daemon-4d86a85ce347685e.exe)
2026-07-31T04:44:04.3863111Z 
2026-07-31T04:44:04.3863481Z running 723 tests
2026-07-31T04:44:04.3870002Z test access::tests::the_inbound_lock_answers_replies_only_and_only_while_controlled ... ok
2026-07-31T04:44:04.3870631Z test access::tests::the_knock_exemption_hook_refuses_everything_today ... ok
2026-07-31T04:44:04.3871263Z test activity::tests::an_identical_observation_pushes_nothing ... ok
2026-07-31T04:44:04.3871827Z test activity::tests::a_token_change_with_an_identical_state_owes_a_push ... ok
2026-07-31T04:44:04.3872311Z test activity::tests::a_state_change_owes_a_push_both_directions ... ok
2026-07-31T04:44:04.3872723Z test activity::tests::an_unseen_link_owes_a_push ... ok
2026-07-31T04:44:04.3874295Z test activity::tests::remember_forgets_a_vanished_link_so_its_return_re_pushes ... ok
2026-07-31T04:44:04.3875473Z test activity::tests::the_diff_is_per_link_not_per_owner ... ok
2026-07-31T04:44:04.3883038Z test activity::tests::observe_links_on_an_absent_owlery_is_empty ... ok
2026-07-31T04:44:04.3885143Z test adapter_update::tests::delegated_attested_delegates_command ... ok
2026-07-31T04:44:04.3886965Z test adapter_update::tests::delegated_unattested_is_skipped ... ok
2026-07-31T04:44:04.3910633Z test activity::tests::the_flip_marker_is_idempotent_to_drop_and_taken_exactly_once ... ok
2026-07-31T04:44:04.4052665Z test adapter_update::tests::file_pull_verified_against_adapter_key ... ok
2026-07-31T04:44:04.4055457Z test adapter_update::tests::file_pull_tampered_bytes_rejected ... ok
2026-07-31T04:44:04.4055914Z test adapter_update::tests::file_pull_without_payload_is_skipped ... ok
2026-07-31T04:44:04.4056982Z test adapter_update::tests::gh_release_is_managed_cli_side_not_in_pure_plan ... ok
2026-07-31T04:44:04.4144954Z test adapter_update::tests::ripple_conducts_each_adapter_in_order ... ok
2026-07-31T04:44:04.4145450Z test adapter_update::tests::file_pull_wrong_key_rejected ... ok
2026-07-31T04:44:04.8844914Z test access::tests::corrupt_store_degrades_closed_but_replies_survive ... ok
2026-07-31T04:44:04.8893164Z test activity::tests::an_owner_with_no_linked_shell_is_not_observed ... ok
2026-07-31T04:44:04.9201967Z test activity::tests::observe_links_sees_only_online_shells_holding_a_token ... ok
2026-07-31T04:44:04.9202500Z test access::tests::discover_gate_discloses_per_viewer ... ok
2026-07-31T04:44:04.9675125Z test access::tests::gate_feeds_the_proven_sender_endpoint_tier ... ok
2026-07-31T04:44:04.9711515Z test adapter_update::tests::ripple_registered_uses_the_registered_set ... ok
2026-07-31T04:44:04.9717207Z test activity::tests::an_unstamped_owner_observes_undated_and_stays_silent_across_sweeps ... ok
2026-07-31T04:44:04.9763820Z test applyhost::tests::apply_staged_daemonless_swaps_binary_with_no_broker ... ok
2026-07-31T04:44:04.9794887Z test access::tests::reply_passes_where_unsolicited_refused ... ok
2026-07-31T04:44:04.9811837Z test applyhost::tests::brain_restart_verb_raises_the_supervisor_signal ... ok
2026-07-31T04:44:04.9851258Z test applyhost::tests::broker_reports_its_compiled_image_version_over_ipc ... ok
2026-07-31T04:44:04.9854839Z test access::tests::discover_gate_withholds_everything_while_degraded ... ok
2026-07-31T04:44:04.9856492Z test applyhost::tests::staged_already_applied_classifies_up_to_date_vs_newer ... ok
2026-07-31T04:44:04.9860065Z test attach::tests::the_engine_room_has_no_viewport_and_takes_its_controls_from_home ... ok
2026-07-31T04:44:04.9876439Z test applyhost::tests::refresh_brain_cycles_without_staging_or_swap_preconditions ... ok
2026-07-31T04:44:04.9901637Z test applyhost::tests::apply_staged_gates_fail_closed_with_the_seat_untouched ... ok
2026-07-31T04:44:04.9941217Z test access::tests::gate_is_per_surface ... ok
2026-07-31T04:44:04.9955957Z test applyhost::tests::apply_staged_update_set_refuses_broker_touching_payloads ... ok
2026-07-31T04:44:04.9958356Z test brain::tests::a_flagged_sync_frame_baselines_forward_never_backward_on_both_paths ... ok
2026-07-31T04:44:04.9963502Z test brain::tests::an_old_broker_wire_without_the_sync_key_keeps_every_legacy_path ... ok
2026-07-31T04:44:04.9965477Z test brain::tests::cold_brain_still_rejects_a_forward_output_gap ... ok
2026-07-31T04:44:04.9967254Z test brain::tests::peer_reply_deadline_caps_below_carrier_deadline ... ok
2026-07-31T04:44:04.9968641Z test brain::tests::reclassify_peer_reply_maps_timeout_off_poison ... ok
2026-07-31T04:44:04.9982343Z test brain::tests::skip_to_live_accepts_a_forward_seq_jump_via_snap_above ... ok
2026-07-31T04:44:04.9991806Z test brain::tests::controller_resume_from_floor_refetches_after_a_gap ... ok
2026-07-31T04:44:05.0005515Z test brainproc::tests::appended_padding_flips_exe_hash ... ok
2026-07-31T04:44:05.0007944Z test brain::tests::viewer_snap_attach_accepts_a_forward_output_gap ... ok
2026-07-31T04:44:05.0008614Z test brainproc::tests::backoff_doubles_on_fast_death_resets_when_healthy ... ok
2026-07-31T04:44:05.0013697Z test brainproc::tests::bytes_gate_truth_table ... ok
2026-07-31T04:44:05.0014202Z test brainproc::tests::brain_child_args_carry_generation_and_reason ... ok
2026-07-31T04:44:05.0014700Z test brainproc::tests::consumer_gate_spawns_once_when_net_enabled ... ok
2026-07-31T04:44:05.0030197Z test applyhost::tests::apply_staged_daemonless_holds_the_fail_closed_gates ... ok
2026-07-31T04:44:05.0100219Z test applyhost::tests::apply_staged_without_broker_hosted_sessions_swaps_binary ... ok
2026-07-31T04:44:05.0217438Z test access::tests::same_node_always_passes_without_minting ... ok
2026-07-31T04:44:05.0374868Z test access::tests::the_engine_room_refuses_even_this_nodes_own_unsolicited_inbound ... ok
2026-07-31T04:44:05.0534374Z test access::tests::the_inbound_lock_is_reached_through_the_sender_stamped_entry_point ... ok
2026-07-31T04:44:05.0536103Z test brainproc::tests::ready_exe_hash_parses_and_is_n1_readable ... ok
2026-07-31T04:44:05.0608221Z test brainproc::tests::ready_generation_at_reads_file_and_absent_is_none ... ok
2026-07-31T04:44:05.0609662Z test brainproc::tests::ready_generation_parses_stamp_and_fails_safe ... ok
2026-07-31T04:44:05.0659114Z test access::tests::gate_decision_table ... ok
2026-07-31T04:44:05.0660694Z test brainproc::tests::rollback_running_version_is_prior_not_n_minus_one ... ok
2026-07-31T04:44:05.1503946Z test access::tests::the_engine_room_is_disclosed_only_to_the_viewers_it_chose ... ok
2026-07-31T04:44:05.1523837Z test brainproc::tests::select_brain_exe_prefers_canonical_over_per_spawn_current_exe ... ok
2026-07-31T04:44:05.1581462Z test attach::tests::viewer_and_driving_intents_gate_on_different_surfaces ... ok
2026-07-31T04:44:05.1584091Z test autostart::tests::empty_config_is_a_pure_noop ... ok
2026-07-31T04:44:05.1592996Z test brainproc::tests::start_reason_arg_round_trips_and_is_lenient ... ok
2026-07-31T04:44:05.1658759Z test autostart::tests::unresolved_adapter_loud_skips_before_any_launch ... ok
2026-07-31T04:44:05.1695029Z test applyhost::tests::apply_staged_swaps_binary_and_hands_off_without_touching_the_endpoint ... ok
2026-07-31T04:44:05.1747372Z test applyhost::tests::apply_staged_update_set_selects_local_platform_artifact ... ok
2026-07-31T04:44:05.3781607Z test applyhost::tests::apply_staged_refuses_platform_blind_or_mismatched_single ... ok
2026-07-31T04:44:05.3797770Z test broker::tests::a_controller_resume_below_the_floor_is_served_the_repaint_shape ... ok
2026-07-31T04:44:05.3801083Z test broker::tests::a_failed_surface_resize_leaves_the_grid_geometry_unchanged ... ok
2026-07-31T04:44:05.3817780Z test applyhost::tests::apply_staged_refuses_a_quarantined_version ... ok
2026-07-31T04:44:05.3818386Z test broker::tests::a_full_controller_does_not_starve_a_viewer_or_block_the_drain ... ok
2026-07-31T04:44:05.3821207Z test broker::tests::a_grow_keeps_old_geometry_wrapping_and_places_new_output_at_the_new_width ... ok
2026-07-31T04:44:05.3830718Z test broker::tests::a_gap_resume_on_the_same_conn_is_served_not_suppressed ... ok
2026-07-31T04:44:05.3844019Z test broker::tests::a_resume_at_the_floor_keeps_the_raw_ring_replay ... ok
2026-07-31T04:44:05.3858236Z test broker::tests::a_resumed_controller_never_rereceives_a_suppressed_seq ... ok
2026-07-31T04:44:05.3860448Z test broker::tests::a_second_transition_is_refused_while_one_is_in_flight ... ok
2026-07-31T04:44:05.3863240Z test broker::tests::a_shrink_parses_held_output_at_the_geometry_it_was_emitted_under ... ok
2026-07-31T04:44:05.4476274Z test broker::tests::a_reap_clears_the_control_stamps_but_never_the_hosting_authority ... ok
2026-07-31T04:44:05.6610319Z test broker::tests::a_take_and_a_detach_each_drop_the_engine_rooms_empowerments ... ok
2026-07-31T04:44:05.6611034Z test broker::tests::advance_delivered_is_monotonic ... ok
2026-07-31T04:44:05.6621207Z test broker::tests::an_aborted_transition_syncs_at_the_old_geometry_with_no_size_frame ... ok
2026-07-31T04:44:05.6628290Z test broker::tests::append_overflow_flags_the_evicted_viewer_for_skip_to_live ... ok
2026-07-31T04:44:05.6641906Z test broker::tests::apply_once_enqueues_ptywrite_exactly_once_and_dedups_replay ... ok
2026-07-31T04:44:05.8495601Z test broker::tests::a_viewer_below_the_floor_gets_the_repaint_and_skip_to_live_stays_empty ... ok
2026-07-31T04:44:05.8497418Z test broker::tests::chunk_text_splits_and_reassembles_exactly ... ok
2026-07-31T04:44:05.8510127Z test broker::tests::clamp_or_reset_resets_a_torn_ring_only ... ok
2026-07-31T04:44:05.8518135Z test broker::tests::cold_attach_repaint_plus_next_differential_matches_independent_emulator ... ok
2026-07-31T04:44:05.8519389Z test broker::tests::contains_subslice_finds_contiguous_only ... ok
2026-07-31T04:44:05.8520338Z test broker::tests::contiguous_advance_freezes_on_a_gap ... ok
2026-07-31T04:44:05.8528285Z test broker::tests::controller_write_stall_predicate_distinguishes_wedged_from_idle ... ok
2026-07-31T04:44:05.8529217Z test broker::tests::delivered_cursor_advances_only_on_ok_and_is_monotonic ... ok
2026-07-31T04:44:05.9725353Z test broker::tests::attach_initial_batch_is_a_clean_alt_screen_repaint_not_the_raw_ring ... ok
2026-07-31T04:44:05.9726468Z test broker::tests::echo_verified_catches_a_swallowed_head ... ok
2026-07-31T04:44:05.9740642Z test broker::tests::equal_generation_same_conn_is_an_idempotent_replay ... ok
2026-07-31T04:44:05.9751424Z test broker::tests::exit_enqueues_behind_queued_output_per_sink ... ok
2026-07-31T04:44:05.9762838Z test broker::tests::gap_resume_resubscribe_preserves_the_generation_against_stale_replay ... ok
2026-07-31T04:44:05.9782602Z test broker::tests::generation_ladder_newer_supersedes_loudly_older_refused_both_intents ... ok
2026-07-31T04:44:05.9784641Z test broker::tests::input_enqueue_drops_and_stamps_on_full_then_heals_on_drain ... ok
2026-07-31T04:44:05.9786821Z test broker::tests::input_writer_preserves_strict_fifo_order_through_the_sole_writer ... ok
2026-07-31T04:44:05.9811506Z test broker::tests::local_controller_wedged_scopes_to_the_brains_own_conn ... ok
2026-07-31T04:44:05.9816086Z test broker::tests::lock_floor_recovers_a_poisoned_inject_floor ... ok
2026-07-31T04:44:05.9818115Z test broker::tests::miss_respool_is_once_then_dead_letters ... ok
2026-07-31T04:44:05.9819229Z test broker::tests::miss_strikes_exhausted_at_budget ... ok
2026-07-31T04:44:05.9820507Z test broker::tests::only_the_supervised_generation_can_claim_the_coordinator_image ... ok
2026-07-31T04:44:05.9825027Z test broker::tests::output_log_tap_reads_bytes_since_snapshot ... ok
2026-07-31T04:44:05.9826193Z test broker::tests::pair_hold_lifecycle_decisions ... ok
2026-07-31T04:44:05.9827408Z test broker::tests::rc_input_fence_scopes_to_rc_minted_non_controller_input_only ... ok
2026-07-31T04:44:05.9906367Z test broker::tests::read_translation_command_none_when_absent ... ok
2026-07-31T04:44:06.0038124Z test broker::tests::read_translation_command_reads_declared ... ok
2026-07-31T04:44:06.0061677Z test broker::tests::reap_dead_controller_clears_a_finished_writer ... ok
2026-07-31T04:44:06.0069661Z test broker::tests::reap_dead_controller_leaves_a_live_writer_untouched ... ok
2026-07-31T04:44:06.0076675Z test broker::tests::reap_evicts_a_blocked_writer_not_only_an_exited_one ... ok
2026-07-31T04:44:06.0082623Z test broker::tests::recover_log_clamps_a_poisoned_torn_ring ... ok
2026-07-31T04:44:06.0085700Z test broker::tests::recover_reopens_a_poisoned_sessions_map ... ok
2026-07-31T04:44:06.0096846Z test broker::tests::revoked_incumbent_writer_emits_the_terminal_displaced ... ok
2026-07-31T04:44:06.0111019Z test broker::tests::same_identity_resubscribe_refuses_a_stale_generation ... ok
2026-07-31T04:44:06.0112510Z test broker::tests::select_endpoints_running_adapter_filters_dedups_sorts ... ok
2026-07-31T04:44:06.0113959Z test broker::tests::sessions_reply_resume_seq_defaults_when_absent ... ok
2026-07-31T04:44:06.0115145Z test broker::tests::should_settle_rearms_on_observable_pty ... ok
2026-07-31T04:44:06.0126125Z test broker::tests::stale_generation_detach_never_clears_the_newer_controller ... ok
2026-07-31T04:44:06.0855849Z test broker::tests::stale_snapshot_stamp_write_refused_after_reap_generation_bump ... ok
2026-07-31T04:44:06.0867671Z test broker::tests::stalled_incumbent_is_evicted_on_reattach_and_control_released ... ok
2026-07-31T04:44:06.0868622Z test broker::tests::stamp_divergence_gates_writes ... ok
2026-07-31T04:44:06.1898564Z test broker::tests::stamp_driven_by_latches_own_node_hex_verbatim_like_remote ... ok
2026-07-31T04:44:06.2658149Z test broker::tests::delivery_is_suppressed_during_a_transition_and_one_sync_frame_substitutes ... ok
2026-07-31T04:44:06.3321802Z test brainproc::tests::exe_hash_computed_exactly_once_across_n_publishes ... ok
2026-07-31T04:44:06.4144988Z test brainproc::tests::rolled_back_record_spawns_rollback_binary_on_a_fresh_supervisor ... ok
2026-07-31T04:44:06.4612024Z test broker::tests::taking_the_engine_rooms_controls_costs_a_member_or_admin_code ... ok
2026-07-31T04:44:06.4615782Z test broker::tests::the_suppressed_window_is_exempt_from_the_controller_eviction_deadline ... ok
2026-07-31T04:44:06.4625342Z test broker::tests::tracked_state_inside_the_window_surfaces_in_the_sync_frame ... ok
2026-07-31T04:44:06.4630463Z test broker::tests::untracked_toggles_defer_into_the_sync_frame_and_hyperlinks_drop ... ok
2026-07-31T04:44:06.4631854Z test broker::tests::viewer_overflow_or_disconnect_evicts_never_blocks ... ok
2026-07-31T04:44:06.5575485Z test broker::tests::the_engine_room_refuses_every_viewport_and_every_off_node_attach ... ok
2026-07-31T04:44:06.5576112Z test broker::tests::wake_gate_decision_truth_table ... ok
2026-07-31T04:44:06.6056952Z test broker::tests::superseded_controller_writer_is_epoch_gated_silent_one_live_writer_per_conn ... ok
2026-07-31T04:44:06.6057783Z test broker::tests::wrapper_alive_prefers_the_table_and_falls_back_where_there_is_none ... ok
2026-07-31T04:44:06.6058925Z test broker::tests::zombie_verdict_table ... ok
2026-07-31T04:44:06.6060984Z test codec::tests::back_to_back_frames_decode_independently ... ok
2026-07-31T04:44:06.6062279Z test codec::tests::frame_round_trips_through_buffer ... ok
2026-07-31T04:44:06.6063328Z test codec::tests::oversized_prefix_rejected ... ok
2026-07-31T04:44:06.6130874Z test config::tests::auto_suspend_knob_is_opt_in_default_off ... ok
2026-07-31T04:44:06.6191158Z test config::tests::crash_grace_is_config_driven ... ok
2026-07-31T04:44:06.6251566Z test config::tests::detached_subnets_knob_defaults_empty ... ok
2026-07-31T04:44:06.6308720Z test config::tests::full_auto_update_is_gated_by_default ... ok
2026-07-31T04:44:06.6363627Z test config::tests::malformed_file_degrades_to_default ... ok
2026-07-31T04:44:06.6368886Z test config::tests::missing_file_is_default ... ok
2026-07-31T04:44:06.6425035Z test config::tests::pulse_period_is_config_driven ... ok
2026-07-31T04:44:06.6585883Z test config::tests::relay_choice_is_config_driven ... ok
2026-07-31T04:44:06.6646736Z test config::tests::save_load_roundtrip ... ok
2026-07-31T04:44:06.6755345Z test config::tests::startup_endpoints_roundtrip ... ok
2026-07-31T04:44:06.6974997Z test config::tests::upsert_startup_endpoint_appends_then_replaces_preserving_other_knobs ... ok
2026-07-31T04:44:06.6979191Z test conn::tests::conn_ids_are_unique_and_labels_stay_bounded ... ok
2026-07-31T04:44:06.6983613Z test conn::tests::organic_write_failure_still_poisons_and_is_not_the_timeout_class ... ok
2026-07-31T04:44:06.6986374Z test conn::tests::retirement_token_splits_deadline_from_organic_with_attribution_parity ... ok
2026-07-31T04:44:06.6987640Z test consent::tests::decide_honors_full_auto_flag ... ok
2026-07-31T04:44:06.7364078Z test consent::tests::no_live_session_resolves_to_none ... ok
2026-07-31T04:44:06.7657959Z test brainproc::tests::planned_restart_respawns_with_update_reason ... ok
2026-07-31T04:44:06.7841126Z test brainproc::tests::ready_but_wrong_bytes_rolls_back_never_promotes ... ok
2026-07-31T04:44:06.7841944Z test crc_swap::tests::apply_rollback_never_strands ... ok
2026-07-31T04:44:06.7951669Z test brainproc::tests::clear_before_spawn_defeats_exact_generation_stale_file ... ok
2026-07-31T04:44:06.7956039Z test crc_swap::tests::crash_recovery_missing_target_keeps_last_good_old ... ok
2026-07-31T04:44:06.7956488Z test brainproc::tests::ready_but_old_gen_never_drains_does_not_promote_rolls_back ... ok
2026-07-31T04:44:06.7999977Z test brainproc::tests::ready_candidate_promotes_once_old_gen_drains ... ok
2026-07-31T04:44:06.8082664Z test brainproc::tests::ready_with_matching_bytes_promotes ... ok
2026-07-31T04:44:06.8117666Z test crc_swap::tests::apply_swaps_changed_creates_new_untouched_identical ... ok
2026-07-31T04:44:06.8121974Z test crc_swap::tests::displace_picks_fresh_old_name_and_gc_sweeps_stale ... ok
2026-07-31T04:44:06.8203978Z test crc_swap::tests::swap_error_carries_op_and_paths ... ok
2026-07-31T04:44:06.8257098Z test crc_swap::tests::plan_recurses_nested_dirs ... ok
2026-07-31T04:44:06.8265645Z test crc_swap::tests::plan_selects_only_changed ... ok
2026-07-31T04:44:06.8560399Z test broker::tests::supervised_worker_panic_faults_and_reaps_child ... ok
2026-07-31T04:44:06.8561967Z test daemon::tests::drive_ladder_all_err_returns_last_err ... ok
2026-07-31T04:44:06.8564753Z test daemon::tests::drive_ladder_falls_through_to_next_rung_on_err ... ok
2026-07-31T04:44:06.8567240Z test daemon::tests::drive_ladder_picks_first_ok_rung ... ok
2026-07-31T04:44:06.8575507Z test daemon::tests::ensure_declines_only_against_a_standing_operator_stop ... ok
2026-07-31T04:44:06.8596588Z test daemon::tests::a_scrubbed_variable_never_reaches_the_child ... ok
2026-07-31T04:44:06.8660228Z test daemon::tests::breakaway_spawn_escapes_a_kill_on_close_job ... ok
2026-07-31T04:44:06.8662697Z test daemon::tests::launch_ladder_order_is_wmi_schtasks_breakaway_injob ... ok
2026-07-31T04:44:06.8665298Z test daemon::tests::net_retry_backoff_doubles_then_caps ... ok
2026-07-31T04:44:06.8666936Z test daemon::tests::null_std_handles_only_on_a_pipe_stderr ... ok
2026-07-31T04:44:06.8717966Z test daemon::tests::implicit_ensure_declines_without_clearing_the_inhibit ... ok
2026-07-31T04:44:06.8720060Z test daemon::tests::the_refusal_line_names_the_remedy ... ok
2026-07-31T04:44:06.8721827Z test daemon::tests::windows_arg_quoting_roundtrips_the_rules ... ok
2026-07-31T04:44:06.8723366Z test daemon::tests::wmi_create_script_carries_the_no_window_startup_spec ... ok
2026-07-31T04:44:06.8725223Z test deadline::tests::advance_after_fire_steps_one_grid_normally_and_collapses_a_stall ... ok
2026-07-31T04:44:06.8802391Z test consent::tests::resolves_most_recently_active_live_session ... ok
2026-07-31T04:44:06.8995013Z test broker::tests::windows_session_is_zombie_sees_a_handle_held_corpse_as_dead ... ok
2026-07-31T04:44:06.9064925Z test daemon::tests::spawn_env_additions_reach_the_child_and_keep_the_inherited_environment ... ok
2026-07-31T04:44:06.9065940Z test deadline::tests::next_fire_between_grid_points_rounds_up ... ok
2026-07-31T04:44:06.9067304Z test deadline::tests::next_fire_long_jump_collapses_missed_ticks_to_one ... ok
2026-07-31T04:44:06.9068472Z test deadline::tests::next_fire_on_grid_returns_now_and_advances_strictly ... ok
2026-07-31T04:44:06.9069380Z test deadline::tests::next_fire_saturates_when_now_precedes_anchor ... ok
2026-07-31T04:44:06.9070477Z test deadline::tests::one_shot_fires_at_or_after_target_and_never_resets ... ok
2026-07-31T04:44:07.0094735Z test daemon::tests::a_tree_teardown_reaches_a_grandchild_the_service_spawned ... ok
2026-07-31T04:44:07.0211871Z test crc_swap::tests::mapped_old_does_not_brick_apply_displaces_aside ... ok
2026-07-31T04:44:07.0212978Z test deadline::tests::zero_interval_degrades_to_config_default ... ok
2026-07-31T04:44:07.0215522Z test deelevate::tests::env_overlay_keeps_explicit_spt_home_alive ... ok
2026-07-31T04:44:07.0216854Z test deelevate::tests::plan_spawn_deelevates_only_with_a_target ... ok
2026-07-31T04:44:07.0218783Z test digest::tests::common_prefix_len_finds_the_unchanged_head ... ok
2026-07-31T04:44:07.0232100Z test daemon::tests::detached_no_inherit_falls_back_under_a_breakaway_denying_job ... ok
2026-07-31T04:44:07.1409523Z test brainproc::tests::trial_promotes_on_ready_then_supervises_the_accepted_binary ... ok
2026-07-31T04:44:07.1411151Z test digest::tests::merge_by_ts_interleaves_context ... ok
2026-07-31T04:44:07.1550768Z test brainproc::tests::stale_generation_minus_one_ready_never_promotes ... ok
2026-07-31T04:44:07.1822371Z test brainproc::tests::supervisor_owns_generation_and_stamps_start_reason ... ok
2026-07-31T04:44:07.1823376Z test digest::tests::resolve_config_precedence ... ok
2026-07-31T04:44:07.1825478Z test digest::tests::supersede_collapses_cross_generation_replay_to_newest ... ok
2026-07-31T04:44:07.1826848Z test digest::tests::supersede_is_noop_on_disjoint_sessions ... ok
2026-07-31T04:44:07.1828332Z test digest::tests::supersede_keeps_within_generation_repeats ... ok
2026-07-31T04:44:07.1829781Z test digest::tests::supersede_trims_divider_around_emptied_middle_generation ... ok
2026-07-31T04:44:07.1831761Z test digesthub::tests::dropped_subscriber_is_pruned ... ok
2026-07-31T04:44:07.1833333Z test digesthub::tests::project_and_publish_stores_latest ... ok
2026-07-31T04:44:07.1834784Z test digesthub::tests::publish_delta_is_tail_then_full_refresh ... ok
2026-07-31T04:44:07.1836766Z test digesthub::tests::render_is_glanceable ... ok
2026-07-31T04:44:07.1838316Z test digesthub::tests::subscribe_returns_current_base ... ok
2026-07-31T04:44:07.1839647Z test dispatch::tests::breaker_trips_with_doubling_capped_window_and_resets_on_progress ... ok
2026-07-31T04:44:07.1841563Z test dispatch::tests::classifies_every_family_by_first_line_shape ... ok
2026-07-31T04:44:07.1843608Z test dispatch::tests::classify_failure_seat_blocked_is_exactly_the_three_discipline_strings ... ok
2026-07-31T04:44:07.1844681Z test dispatch::tests::cold_enumeration_claims_at_most_the_pool_bound_per_poll ... ok
2026-07-31T04:44:07.1846683Z test dispatch::tests::digest_pull_and_rest_never_read_as_each_other ... ok
2026-07-31T04:44:07.1848206Z test dispatch::tests::dispatch_event_carries_the_complete_key_set ... ok
2026-07-31T04:44:07.1849770Z test dispatch::tests::feed_accumulator_commits_per_bound_never_per_chunk ... ok
2026-07-31T04:44:07.1850840Z test dispatch::tests::finished_is_terminal_for_attach_only ... ok
2026-07-31T04:44:07.1852347Z test dispatch::tests::line_endpoint_resolves_each_family_identity_key ... ok
2026-07-31T04:44:07.1853650Z test dispatch::tests::oneway_seatblocked_strikes_out_terminal_while_request_reply_paces_forever ... ok
2026-07-31T04:44:07.1855148Z test dispatch::tests::only_the_old_broker_unknown_verb_answer_falls_back_to_the_peek ... ok
2026-07-31T04:44:07.1856467Z test dispatch::tests::seat_blocked_requeues_budget_free_paced_by_the_breaker_window ... ok
2026-07-31T04:44:07.1857573Z test dispatch::tests::transient_failure_requeues_bounded_and_terminal_never_reenters ... ok
2026-07-31T04:44:07.1859013Z test dispatch::tests::unknown_shapes_refuse_classification ... ok
2026-07-31T04:44:07.1860332Z test docshost::tests::content_types_cover_the_bundle_classes ... ok
2026-07-31T04:44:07.1861662Z test docshost::tests::port_resolution_env_config_default ... ok
2026-07-31T04:44:07.1863569Z test docshost::tests::sanitizer_admits_pages_and_rejects_escapes ... ok
2026-07-31T04:44:07.1866333Z test drivehub::tests::a_following_op_is_served_when_nothing_refused ... ok
2026-07-31T04:44:07.1872838Z test drivehub::tests::a_foreign_owlery_is_refused_pre_ack_under_its_own_name ... ok
2026-07-31T04:44:07.1874161Z test drivehub::tests::activity_and_drive_never_clobber_each_other ... ok
2026-07-31T04:44:07.1875744Z test drivehub::tests::activity_take_is_latest_wins_and_exactly_once ... ok
2026-07-31T04:44:07.1877648Z test drivehub::tests::an_unknown_op_hangs_up_instead_of_being_swallowed ... ok
2026-07-31T04:44:07.1878984Z test drivehub::tests::clear_evicts_both_classes ... ok
2026-07-31T04:44:07.1880154Z test drivehub::tests::clear_evicts_the_slot ... ok
2026-07-31T04:44:07.1881641Z test drivehub::tests::dead_generation_activity_frame_is_never_served ... ok
2026-07-31T04:44:07.1883067Z test drivehub::tests::dead_generation_frame_is_never_served ... ok
2026-07-31T04:44:07.1884710Z test drivehub::tests::drive_result_activity_key_is_additive_on_the_wire ... ok
2026-07-31T04:44:07.1885951Z test drivehub::tests::only_a_pre_ack_refusal_permits_a_second_spawn ... ok
2026-07-31T04:44:07.1887298Z test drivehub::tests::slots_are_per_owner ... ok
2026-07-31T04:44:07.1888518Z test drivehub::tests::take_is_exactly_once ... ok
2026-07-31T04:44:07.1890028Z test drivehub::tests::the_launch_reply_shapes_round_trip ... ok
2026-07-31T04:44:07.1926718Z test brainproc::tests::supervisor_respawns_brain_until_stopped ... ok
2026-07-31T04:44:07.1928284Z test drivehub::tests::write_is_latest_wins ... ok
2026-07-31T04:44:07.2140219Z test effect::tests::applied_set_survives_reopen ... ok
2026-07-31T04:44:07.2152576Z test effect::tests::apply_once_does_not_hold_the_journal_lock_across_effect ... ok
2026-07-31T04:44:07.2621276Z test brainproc::tests::trial_kills_alive_never_ready_candidate_before_rollback ... ok
2026-07-31T04:44:07.2937119Z test effect::tests::each_named_minter_namespaces_its_ops ... ok
2026-07-31T04:44:07.2985388Z test effect::tests::failed_effect_is_not_recorded_applied ... ok
2026-07-31T04:44:07.2986813Z test effect::tests::marker_is_single_source_and_frozen ... ok
2026-07-31T04:44:07.2988382Z test effect::tests::minter_tag_round_trips ... ok
2026-07-31T04:44:07.3010795Z test effect::tests::open_creates_missing_parent_dirs ... ok
2026-07-31T04:44:07.3318896Z test effect::tests::poisoned_journal_lock_still_applies_subsequent_ops ... ok
2026-07-31T04:44:07.3638122Z test effect::tests::ptywrite_skips_the_durable_journal_write_while_netsend_persists ... ok
2026-07-31T04:44:07.3823000Z test effect::tests::recover_is_migration_free ... ok
2026-07-31T04:44:07.3832689Z test effect::tests::second_apply_for_same_key_is_deduped ... ok
2026-07-31T04:44:07.4121051Z test effect::tests::shellchan_and_rc_same_session_dont_collide ... ok
2026-07-31T04:44:07.4122314Z test effect::tests::with_tracing_retry_no_retry_on_success ... ok
2026-07-31T04:44:07.4123562Z test effect::tests::with_tracing_retry_passes_through_other_errors ... ok
2026-07-31T04:44:07.4125169Z test effect::tests::with_tracing_retry_retries_once_on_no_longer_held ... ok
2026-07-31T04:44:07.4126375Z test effect::tests::with_tracing_retry_terminal_is_public_language ... ok
2026-07-31T04:44:07.4128518Z test frame::tests::envelope_with_unknown_trailing_field_decodes_on_older_peer ... ok
2026-07-31T04:44:07.4130114Z test frame::tests::handshake_accepts_newer_brain_on_older_broker ... ok
2026-07-31T04:44:07.4131339Z test frame::tests::handshake_rejects_below_floor ... ok
2026-07-31T04:44:07.4132659Z test frame::tests::handshake_rejects_role_mismatch ... ok
2026-07-31T04:44:07.4134141Z test frame::tests::unknown_kind_is_not_a_decode_error ... ok
2026-07-31T04:44:07.4135583Z test grants::tests::escalation_answers_apply ... ok
2026-07-31T04:44:07.4137439Z test grants::tests::escalation_ask_body_roundtrip ... ok
2026-07-31T04:44:07.4441642Z test effect::tests::gauntlet_is_exactly_once_across_brain_crashes ... ok
2026-07-31T04:44:07.4442774Z test grants::tests::no_session_escalates_with_none_target ... ok
2026-07-31T04:44:07.4444050Z test grants::tests::preconsent_flags_author_grants ... ok
2026-07-31T04:44:07.4445333Z test grants::tests::reserved_capabilities_refuse_even_when_granted ... ok
2026-07-31T04:44:07.4446536Z test grants::tests::ungranted_escalates_granted_allows ... ok
2026-07-31T04:44:07.4450213Z test harnesshost::tests::mint_session_id_is_fresh_hex ... ok
2026-07-31T04:44:07.4454988Z test harnesshost::tests::node_key_fills_advertised_label_in_session_template ... ok
2026-07-31T04:44:07.4458079Z test harnesshost::tests::node_missing_reference_fails_loud ... ok
2026-07-31T04:44:07.4465270Z test harnesshost::tests::prepare_fails_closed_on_wrong_kind_missing_role_and_bad_template ... ok
2026-07-31T04:44:07.4466226Z test harnesshost::tests::prepare_fills_env_inject_values_with_substitution ... ok
2026-07-31T04:44:07.4469481Z test harnesshost::tests::prepare_fills_id_and_session_into_self_command ... ok
2026-07-31T04:44:07.4472452Z test harnesshost::tests::prepare_resume_falls_back_to_self_when_no_resume_role ... ok
2026-07-31T04:44:07.4475788Z test harnesshost::tests::prepare_selects_resume_template_on_resume_else_self ... ok
2026-07-31T04:44:07.4482096Z test harnesshost::tests::prepare_threads_translation_binary_when_declared ... ok
2026-07-31T04:44:07.4484556Z test harnesshost::tests::provisional_session_id_recognizes_own_mint_only ... ok
2026-07-31T04:44:07.4500050Z test harnesshost::tests::translation_binary_resolves_against_install_dir ... ok
2026-07-31T04:44:07.5006322Z test drivehub::tests::the_pre_ack_causes_are_three_distinct_diagnostics ... ok
2026-07-31T04:44:07.5919989Z test brainproc::tests::trial_rolls_back_after_budget_of_pre_ready_exits ... ok
2026-07-31T04:44:08.4778303Z test broker::tests::viewer_writer_emits_evicted_marker_only_on_an_evicted_close ... ok
2026-07-31T04:44:11.8665629Z test daemon::tests::a_captured_spawn_inherits_only_the_handle_in_its_allowlist ... FAILED
2026-07-31T04:44:12.9265793Z test daemon::tests::is_running_tracks_the_seed_channel ... ok
2026-07-31T04:44:12.9330223Z test deadline::tests::cold_and_crash_write_fresh_anchor_at_now ... ok
2026-07-31T04:44:12.9389785Z test deadline::tests::corrupt_file_degrades_to_fresh ... ok
2026-07-31T04:44:12.9408356Z test deadline::tests::distinct_keys_do_not_cross_clobber ... ok
2026-07-31T04:44:12.9409872Z test lifecycle::tests::event_turn_timeout_floors_at_thirty_seconds ... ok
2026-07-31T04:44:12.9412756Z test lifecycle::tests::first_turn_psyche_context_is_never_empty ... ok
2026-07-31T04:44:12.9429674Z test deadline::tests::update_keeps_anchor_and_refreshes_interval ... ok
2026-07-31T04:44:12.9431260Z test lifecycle::tests::is_owlery_internal_cases ... ok
2026-07-31T04:44:12.9439110Z test deadline::tests::update_with_no_file_falls_back_fresh ... ok
2026-07-31T04:44:13.2344519Z test digest::tests::extractor_spans_sessions_with_a_boundary_marker ... ok
2026-07-31T04:44:13.2560234Z test digest::tests::log_less_two_origin_merge_interleaves_by_ts ... ok
2026-07-31T04:44:13.2754063Z test digest::tests::projects_a_log_less_endpoint_from_digest_log ... ok
2026-07-31T04:44:13.2762369Z test digest::tests::projects_empty_for_a_sourceless_endpoint ... ok
2026-07-31T04:44:13.2764365Z test lifecycle::tests::psyche_turn_keys_carry_custody_sids_and_context_file_path ... ok
2026-07-31T04:44:13.2765814Z test lifecycle::tests::psyche_turn_strikes_exhausted_boundary ... ok
2026-07-31T04:44:13.2832930Z test lifecycle::tests::psyche_context_file_continue_is_zero_bytes_fresh_is_nonempty ... ok
2026-07-31T04:44:13.5624171Z test grants::tests::escalation_notif_fires_to_most_recent_and_roundtrips ... ok
2026-07-31T04:44:13.7588215Z test inject::tests::has_parked_idle_spool_gates_on_idle_hosted_and_pending ... ok
2026-07-31T04:44:13.9320232Z test inject::tests::shared_inject_leg_detects_spt_hosted ... ok
2026-07-31T04:44:13.9693884Z test lifecycle::tests::base_keys_carries_single_subnet_no_home ... ok
2026-07-31T04:44:14.1461230Z test lifecycle::tests::crash_signoff_spares_recovered_self ... ok
2026-07-31T04:44:14.6041839Z test lifecycle::tests::crash_signoff_tears_down_when_still_gone ... ok
2026-07-31T04:44:14.6847477Z test lifecycle::tests::custody_survives_parent_boundary_and_reseed_clears ... ok
2026-07-31T04:44:14.7703032Z test lifecycle::tests::echo_fire_resolves_relative_commune_dir_against_endpoint_cwd ... ok
2026-07-31T04:44:14.7819331Z test lifecycle::tests::echo_fire_skips_loud_on_relative_dir_without_cwd ... ok
2026-07-31T04:44:14.8139830Z test lifecycle::tests::harness_owner_gone_anchors_on_parent_pid ... ok
2026-07-31T04:44:14.8141973Z test lifecycle::tests::resolve_endpoint_drop_dir_cases ... ok
2026-07-31T04:44:14.8165987Z test lifecycle::tests::manifest_cell_refresh_swaps_manifest_and_runtime ... ok
2026-07-31T04:44:14.8185791Z test lifecycle::tests::node_key_fills_advertised_label_in_lifecycle_base_keys ... ok
2026-07-31T04:44:15.0791258Z test lifecycle::tests::orphan_watch_fires_on_dead_owner ... ok
2026-07-31T04:44:15.0792357Z test lifecycle::tests::session_not_found_discriminates_reseed_from_strike ... ok
2026-07-31T04:44:15.0888216Z test lifecycle::tests::orphan_watch_honors_stop_for_live_owner ... ok
2026-07-31T04:44:15.2162382Z test lifecycle::tests::psyche_turn_threads_parent_read_env_into_spawn ... ok
2026-07-31T04:44:15.2490675Z test lifecycle::tests::pulse_loop_does_not_write_anchor_per_fire ... ok
2026-07-31T04:44:15.2957601Z test lifecycle::tests::pulse_loop_is_config_paced_and_killable ... ok
2026-07-31T04:44:15.2963658Z test linkhost::tests::per_capability_act_gate_blocks_until_class_scoped_grant ... ok
2026-07-31T04:44:15.3438369Z test lifecycle::tests::pulse_loop_update_preserves_phase_crash_rebases ... ok
2026-07-31T04:44:15.3929774Z test lifecycle::tests::pulse_recency_and_auto_suspend_follow_resting_state ... ok
2026-07-31T04:44:17.3420656Z test lifecycle::tests::pulse_tick_ingests_drop ... ok
2026-07-31T04:44:28.5667414Z test lifecycle::tests::relative_commune_dir_resolves_against_endpoint_cwd_and_fills_project_branch ... ok
2026-07-31T04:44:28.5808907Z test lifecycle::tests::reload_fires_on_disk_change ... ok
2026-07-31T04:44:28.5983073Z test lifecycle::tests::reload_keeps_last_good_on_unparseable ... ok
2026-07-31T04:44:28.6051868Z test lifecycle::tests::reload_noop_when_unchanged ... ok
2026-07-31T04:44:28.6062951Z test lifecycle::tests::reload_noop_without_install_dir ... ok
2026-07-31T04:44:28.6064791Z test livehost::tests::decide_resume_goal_table ... ok
2026-07-31T04:44:28.6899399Z test lifecycle::tests::rest_edge_echo_success_clears_stale_psyche_stamp ... ok
2026-07-31T04:44:28.6900542Z test livehost::tests::hybrid_self_heal_due_table ... ok
2026-07-31T04:44:28.7115531Z test livehost::tests::legacy_psyche_sweep_guard_is_id_specific_and_fail_safe ... ok
2026-07-31T04:44:28.7330497Z test livehost::tests::live_bin_gc_removes_own_copy_and_displaces_when_locked ... ok
2026-07-31T04:44:29.2123391Z test lifecycle::tests::rest_event_fires_echo_once_and_wake_resurfaces ... ok
2026-07-31T04:44:30.5569527Z test lifecycle::tests::role_less_manifest_ticks_strike_free ... ok
2026-07-31T04:44:30.6650304Z test lifecycle::tests::thrash_budget_trips_on_a_synthetic_failure_loop_without_touching_status ... ok
2026-07-31T04:44:30.7110142Z test lifecycle::tests::turn_budget_stamps_on_exhaustion_and_clears_on_success ... ok
2026-07-31T04:44:31.3821335Z test linkhost::tests::cmd_wakes_a_stale_online_persistent_instance ... ok
2026-07-31T04:44:35.2815115Z test linkhost::tests::gateway_typed_owner_resolves_and_drives_keyed_on_id_not_type ... ok
2026-07-31T04:44:35.4961937Z test linkhost::tests::prepare_drive_is_live_or_drop_and_never_spools ... ok
2026-07-31T04:44:35.6618238Z test linkhost::tests::relink_refuses_a_live_instance_but_recovers_a_stale_online_one ... ok
2026-07-31T04:44:35.7801556Z test linkhost::tests::run_action_drive_drops_offline_without_wake_or_spool ... ok
2026-07-31T04:44:35.9504884Z test linkhost::tests::run_action_refuses_gated_op_without_spooling ... ok
2026-07-31T04:44:36.7017120Z test linkhost::tests::run_action_relinks_drives_and_refuses ... ok
2026-07-31T04:44:36.8165769Z test livehost::tests::boot_gate_offlines_sessionless_controllable_then_reconcile_skips_host ... ok
2026-07-31T04:44:36.8166594Z test livehost::tests::reconcile_routing_controllable_falls_through_to_broker_session_truth ... ok
2026-07-31T04:44:36.8832032Z test livehost::tests::broker_failure_skips_the_pass_never_mass_offlines ... ok
2026-07-31T04:44:36.9586800Z test livehost::tests::control_reap_clears_sticky_controlled_on_already_offline_perch ... ok
2026-07-31T04:44:37.0228607Z test livehost::tests::fresh_brain_rehydrates_an_online_live_endpoint ... ok
2026-07-31T04:44:37.0229603Z test livehost::tests::restart_resume_gate_reruns_the_orphaned_controllable_dead_set_regardless_of_state ... ok
2026-07-31T04:44:37.8532268Z test livehost::tests::pull_liveness_demotes_a_relay_held_endpoint_instead_of_offlining_it ... ok
2026-07-31T04:44:37.8534080Z test machineid::tests::hash_is_domain_separated_and_stable ... ok
2026-07-31T04:44:38.1294821Z test livehost::tests::pull_liveness_marks_sessionless_spt_hosted_offline_only ... ok
2026-07-31T04:44:38.1296294Z test msg::tests::bytes_round_trip_through_payload ... ok
2026-07-31T04:44:38.1299629Z test msg::tests::endpoint_injected_envelope_carries_delivered_and_spool_hint ... ok
2026-07-31T04:44:38.1301244Z test msg::tests::endpoint_input_frames_round_trip ... ok
2026-07-31T04:44:38.1302824Z test msg::tests::evicted_envelope_round_trips ... ok
2026-07-31T04:44:38.1305053Z test msg::tests::input_req_absent_ack_defaults_true_n_minus_1_safe ... ok
2026-07-31T04:44:38.1306787Z test msg::tests::input_req_ack_false_round_trips_faithfully ... ok
2026-07-31T04:44:38.1309185Z test msg::tests::net_frames_round_trip_and_tolerate_unknown_fields ... ok
2026-07-31T04:44:38.1310768Z test msg::tests::output_envelope_round_trips ... ok
2026-07-31T04:44:38.1312443Z test msg::tests::output_sync_flag_defaults_absent_and_skips_when_false ... ok
2026-07-31T04:44:38.1314450Z test msg::tests::presence_event_round_trips_and_tolerates_future_kind ... ok
2026-07-31T04:44:38.1316011Z test msg::tests::spawn_req_tolerates_unknown_field ... ok
2026-07-31T04:44:38.1317655Z test msg::tests::stream_lifetime_is_additive_and_defaults_durable ... ok
2026-07-31T04:44:38.1319604Z test msg::tests::two_phase_join_wire_round_trips ... ok
2026-07-31T04:44:38.1321378Z test msg::tests::wire_decodes_old_shape_to_legacy ... ok
2026-07-31T04:44:38.1380329Z test nethost::tests::append_halts_at_first_failed_write_removes_the_seat_and_cancels_the_lease ... ok
2026-07-31T04:44:38.1386704Z test nethost::tests::attach_replay_never_interleaves_with_concurrent_live_appends ... ok
2026-07-31T04:44:38.1393471Z test nethost::tests::begin_attach_refuses_only_while_a_poisoned_prior_still_drains ... ok
2026-07-31T04:44:38.3486292Z test nethost::tests::bounded_block_on_cuts_a_never_completing_op_with_an_ordinary_error ... ok
2026-07-31T04:44:38.5375488Z test nethost::tests::conn_close_sweeps_its_stream_rows ... ok
2026-07-31T04:44:38.5556132Z test nethost::tests::dispatch_stream_infos_excludes_local_and_retired_rows_server_side ... ok
2026-07-31T04:44:38.5614689Z test nethost::tests::displaced_writer_failure_never_cancels_the_successor_lease ... ok
2026-07-31T04:44:38.5670586Z test nethost::tests::finish_halts_and_removes_a_poisoned_seat ... ok
2026-07-31T04:44:38.5862889Z test nethost::tests::host_binds_endpoint_to_node_identity ... ok
2026-07-31T04:44:38.6541108Z test nethost::tests::loopback_conn_is_a_reused_singleton_that_cross_wires_a_stream_pair ... ok
2026-07-31T04:44:38.8598028Z test livehost::tests::pull_reconcile_offlines_perch_when_broker_session_dies ... ok
2026-07-31T04:44:38.8599835Z test nethost::tests::next_seq_counts_appends_not_logical_chunks ... ok
2026-07-31T04:44:38.8801662Z test nethost::tests::op_maps_are_minter_namespaced ... ok
2026-07-31T04:44:38.9608450Z test nethost::tests::open_class_routes_to_the_opener_row_only ... ok
2026-07-31T04:44:38.9612715Z test nethost::tests::opener_capture_gives_up_bounded_on_a_newline_less_stream ... ok
2026-07-31T04:44:38.9614628Z test nethost::tests::opener_pins_first_line_across_full_ring_roll ... ok
2026-07-31T04:44:38.9693402Z test nethost::tests::overflow_detaches_without_lease_cancel_and_the_brain_resumes_from_cursor ... ok
2026-07-31T04:44:38.9758214Z test nethost::tests::presence_log_mirrors_the_seat_discipline ... ok
2026-07-31T04:44:38.9759812Z test nethost::tests::retentive_log_is_lossless_ordered_while_ordinary_log_overwrites ... ok
2026-07-31T04:44:38.9790025Z test livehost::tests::reconcile_attempts_resume_for_a_registered_woken_endpoint ... ok
2026-07-31T04:44:39.0033299Z test nethost::tests::retire_sweep_dismisses_the_seat_and_terminal_retire_drops_the_row ... ok
2026-07-31T04:44:39.0080036Z test nethost::tests::retire_hides_the_row_while_active_rows_stay ... ok
2026-07-31T04:44:39.0338126Z test nethost::tests::send_stream_refuses_on_a_canceled_lease ... ok
2026-07-31T04:44:39.0388096Z test nethost::tests::retired_row_still_flushes_a_late_reply ... ok
2026-07-31T04:44:39.0661458Z test nethost::tests::unsubscribe_releases_only_the_callers_seat_joins_writer_and_is_idempotent ... ok
2026-07-31T04:44:39.0924892Z test nethost::tests::two_hosts_dial_over_loopback ... ok
2026-07-31T04:44:39.2279636Z test livehost::tests::reconcile_converges_a_dead_relay_and_spares_a_live_or_unproven_one ... ok
2026-07-31T04:44:39.2764197Z test livehost::tests::reconcile_does_not_double_host ... ok
2026-07-31T04:44:39.3562432Z test livehost::tests::reconcile_hosts_an_online_live_endpoint_and_drives_its_pulse ... ok
2026-07-31T04:44:39.4015375Z test livehost::tests::reconcile_keeps_driver_on_transient_read_fail_unhosts_on_dir_gone ... ok
2026-07-31T04:44:39.4468182Z test livehost::tests::reconcile_leaves_a_genuinely_suspended_endpoint_alone ... ok
2026-07-31T04:44:39.5469250Z test livehost::tests::reconcile_marks_unbound_skeleton_offline_on_session_death ... ok
2026-07-31T04:44:39.7167930Z test livehost::tests::reconcile_reaps_orphaned_worker_and_spares_live_parent ... ok
2026-07-31T04:44:39.7595786Z test livehost::tests::reconcile_refuses_a_woken_endpoint_with_an_unregistered_adapter ... ok
2026-07-31T04:44:39.7763137Z test livehost::tests::reconcile_skips_a_woken_endpoint_with_no_ledger_row ... ok
2026-07-31T04:44:39.8097655Z test livehost::tests::reconcile_skips_an_offline_live_endpoint ... ok
2026-07-31T04:44:39.8666737Z test livehost::tests::reconcile_unhosts_on_offline_transition ... ok
2026-07-31T04:44:39.9580860Z test nethost::tests::loopback_tunnel_backpressures_without_loss ... ok
2026-07-31T04:44:39.9616785Z test livehost::tests::split_cleanup_clears_all_three_stamps_on_state_quirk_rows ... ok
2026-07-31T04:44:39.9621931Z test machineid::tests::machine_id_hash_resolves_and_is_stable ... ok
2026-07-31T04:44:39.9623926Z test notifgate::tests::an_unvalidatable_notify_passes ... ok
2026-07-31T04:44:39.9625647Z test notifgate::tests::distinct_notifs_both_deliver ... ok
2026-07-31T04:44:40.0465670Z test notifgate::tests::retain_preserves_order_of_the_survivors ... ok
2026-07-31T04:44:40.0467766Z test notifgate::tests::the_validity_gate_decision_table ... ok
2026-07-31T04:44:40.2472452Z test notifsync::tests::concurrent_dismiss_and_surface_commute_across_the_feed ... ok
2026-07-31T04:44:40.2646272Z test notif::tests::consent_decision_produces_notif_only_when_gated ... ok
2026-07-31T04:44:40.4534290Z test notifsync::tests::node_scoped_rows_are_excluded_from_the_feed ... ok
2026-07-31T04:44:40.4537728Z test notifsync::tests::feed_converges_two_stores_and_dismiss_replicates ... ok
2026-07-31T04:44:40.5270407Z test notif::tests::expired_row_is_auto_dismissed_at_boundary_not_surfaced ... ok
2026-07-31T04:44:40.5271929Z test pairhost::tests::a_re_postured_subnet_advises_and_never_applies ... ok
2026-07-31T04:44:40.6316594Z test notifsync::tests::non_member_subnet_record_never_materializes ... ok
2026-07-31T04:44:40.6317445Z test pairhost::tests::joiner_clock_render_shows_step_offset_and_state ... ok
2026-07-31T04:44:40.6318810Z test pairhost::tests::meet_failure_detail_concise_vs_verbose ... ok
2026-07-31T04:44:40.6321298Z test pairhost::tests::meet_final_retry_failing_surrenders_once ... ok
2026-07-31T04:44:40.6323283Z test pairhost::tests::meet_retries_once_after_refresh_on_exhaustion ... ok
2026-07-31T04:44:40.6324520Z test pairhost::tests::the_advisory_says_nothing_was_applied ... ok
2026-07-31T04:44:40.6325729Z test pairhost::tests::wire_errors_classify_for_the_guided_ux ... ok
2026-07-31T04:44:40.6528668Z test notifsync::tests::untrusted_and_cross_subnet_origins_are_dropped ... ok
2026-07-31T04:44:40.6759711Z test presence::tests::mra_degrades_to_local_and_skips_noise_rows ... ok
2026-07-31T04:44:40.6878682Z test presence::tests::snapshot_loading_degrades_on_junk ... ok
2026-07-31T04:44:40.6984609Z test presence::tests::mra_joins_local_and_gossiped_legs_under_one_max ... ok
2026-07-31T04:44:40.7509893Z test presence::tests::subnet_scope_gates_both_legs ... ok
2026-07-31T04:44:40.7691847Z test notif::tests::first_fire_declines_an_already_expired_row ... ok
2026-07-31T04:44:40.7790005Z test projwriter::tests::cold_construct_spawns_no_git_and_first_cycle_publishes ... ok
2026-07-31T04:44:40.7987817Z test projwriter::tests::corrupt_index_is_repaired_and_counted ... ok
2026-07-31T04:44:40.9868234Z test notif::tests::first_fire_reaches_most_recent_visible_endpoint ... ok
2026-07-31T04:44:41.2229942Z test notif::tests::notif_command_renders_all_keys_and_is_opt_in ... ok
2026-07-31T04:44:41.2327012Z test notif::tests::first_fire_redirects_to_a_fresher_remote_winner_unmarked ... ok
2026-07-31T04:44:41.4248550Z test notif::tests::first_fire_rides_the_quiet_window_not_the_live_stream ... ok
2026-07-31T04:44:41.5848854Z test notif::tests::hidden_endpoint_boundary_surfaces_nothing ... ok
2026-07-31T04:44:41.7910062Z test notif::tests::hidden_endpoint_is_never_the_target ... ok
2026-07-31T04:44:41.7911522Z test propagate::tests::classifier_maps_every_status_shape ... ok
2026-07-31T04:44:41.8640517Z test notif::tests::no_live_endpoint_is_a_typed_no_target ... ok
2026-07-31T04:44:42.0264615Z test notif::tests::node_scoped_first_fire_ignores_a_fresher_remote_winner ... ok
2026-07-31T04:44:42.3168544Z test notif::tests::resurface_delivers_undismissed_with_gates ... ok
2026-07-31T04:44:42.5811470Z test notif::tests::rollback_notif_is_loud_and_resurfaces ... ok
2026-07-31T04:44:43.9586327Z test notif::tests::shell_notif_templates_render_for_attached_instances_only ... ok
2026-07-31T04:44:44.3491209Z test notif::tests::suppression_window_holds_cross_endpoint ... ok
2026-07-31T04:44:44.4098512Z test pairhost::tests::an_advisory_records_the_sighting_and_still_applies_nothing ... ok
2026-07-31T04:44:49.3183448Z test projwriter::tests::cwd_invalidation_evicts_shared_cache_entry ... ok
2026-07-31T04:44:49.3185278Z test pump::health::tests::degraded_on_all_peer_failure_healthy_only_on_real_progress ... ok
2026-07-31T04:44:49.3301153Z test pump::health::tests::health_file_roundtrip_and_degrade ... ok
2026-07-31T04:44:49.3379600Z test pump::health::tests::registry_admit_stamp_survives_restart_rounds_and_never_regresses ... ok
2026-07-31T04:44:49.3380956Z test pump::health::tests::stage_parses_from_attributed_reasons ... ok
2026-07-31T04:44:59.9723410Z test projwriter::tests::ordinary_commit_is_noop_config_change_rederives ... ok
2026-07-31T04:45:00.8652553Z test projwriter::tests::writer_thread_debounces_burst_into_one_cycle ... ok
2026-07-31T04:45:03.7312875Z test psyrelay::tests::empty_and_oversize_bodies_drop_typed ... ok
2026-07-31T04:45:03.8145694Z test pump::registry::tests::fire_due_rotations_rotates_due_and_leaves_pending ... ok
2026-07-31T04:45:03.8155905Z test pump::registry::tests::poll_wake_takes_the_advertise_marker_exactly_once ... ok
2026-07-31T04:45:06.8385944Z test psyrelay::tests::notify_reaches_own_user_only ... ok
2026-07-31T04:45:06.8392560Z test pump::tests::choreography_fan_targets_skips_detached_and_self ... ok
2026-07-31T04:45:06.8394061Z test pump::tests::choreography_first_tick_primes_all_legs ... ok
2026-07-31T04:45:06.8395604Z test pump::tests::choreography_mark_after_round_stamps_only_due ... ok
2026-07-31T04:45:06.8397019Z test pump::tests::choreography_peer_step_aborts_on_first_failure ... ok
2026-07-31T04:45:06.8398802Z test pump::tests::choreography_pre_round_once_and_before_any_peer_step ... ok
2026-07-31T04:45:06.8400186Z test pump::tests::choreography_wake_forces_only_that_worker ... ok
2026-07-31T04:45:06.8401654Z test pump::tests::drain_read_classifies_dead_carrier_as_restart_timeout_as_quiet ... ok
2026-07-31T04:45:06.8402770Z test pump::tests::first_tick_is_due_and_never_underflows ... ok
2026-07-31T04:45:06.8694791Z test pump::tests::heartbeat_writes_and_advances ... ok
2026-07-31T04:45:06.8696799Z test pump::tests::peer_leg_outcome_isolates_ordinary_backs_off_carrier_timeout_still_poisons ... ok
2026-07-31T04:45:06.8698282Z test pump::tests::per_peer_backoff_doubles_caps_and_eligibility ... ok
2026-07-31T04:45:06.8704770Z test pump::tests::presence_state_effect_correlates_and_isolates ... ok
2026-07-31T04:45:06.8950867Z test pump::tests::push_feed_retires_its_own_row_after_successful_fin ... ok
2026-07-31T04:45:06.8953158Z test pump::tests::push_target_is_the_full_roster_minus_self_and_tombstoned ... ok
2026-07-31T04:45:06.9087690Z test pump::tests::resolve_submit_addr_walks_the_route_chain ... ok
2026-07-31T04:45:06.9217635Z test pump::tests::startup_reconcile_heals_suspect_rows_and_migrates_invalid_ones ... ok
2026-07-31T04:45:06.9218634Z test pump::tests::supervisor_backoff_doubles_caps_and_resets ... ok
2026-07-31T04:45:06.9524860Z test pump::tests::supervisor_restarts_a_panicking_pump_until_stop ... ok
2026-07-31T04:45:06.9525884Z test pump::tests::wake_forces_a_round_regardless_of_cadence ... ok
2026-07-31T04:45:06.9527335Z test pump::update::tests::advertised_version_finds_dotted_tokens_and_refuses_counter_shapes ... ok
2026-07-31T04:45:06.9528663Z test pump::update::tests::the_retire_predicate_keeps_ahead_and_unparseable_rows ... ok
2026-07-31T04:45:06.9529866Z test pump::update::tests::version_ge_compares_dotted_versions_and_rejects_garbage ... ok
2026-07-31T04:45:10.1828317Z test psyrelay::tests::notify_without_live_endpoint_is_pending ... ok
2026-07-31T04:45:10.1829614Z test reap::tests::reap_without_enroll_is_noop ... ok
2026-07-31T04:45:10.1831080Z test reconcile::tests::active_node_wins ... ok
2026-07-31T04:45:10.1832468Z test reconcile::tests::double_active_tiebreaks_deterministically ... ok
2026-07-31T04:45:10.1834098Z test reconcile::tests::fallback_lowest_non_offline ... ok
2026-07-31T04:45:10.1835312Z test reconcile::tests::no_rows_reconciles_locally ... ok
2026-07-31T04:45:10.2142280Z test registryhost::tests::admitted_feeds_stamp_the_heard_map ... ok
2026-07-31T04:45:11.1769216Z test reap::tests::job_reaps_enrolled_child_and_grandchild ... ok
2026-07-31T04:45:11.4872768Z test psyrelay::tests::null_stdout_driver_fails_the_guard ... ok
2026-07-31T04:45:13.8781381Z test psyrelay::tests::prose_only_relays_nothing ... ok
2026-07-31T04:45:14.0576607Z test registryhost::tests::advertised_status_splits_unbound_warm_from_cold_suspended ... ok
2026-07-31T04:45:16.7225103Z test psyrelay::tests::reply_without_target_is_dropped ... ok
2026-07-31T04:45:18.3024518Z test psyrelay::tests::spoofed_routing_is_stripped_and_restamped ... ok
2026-07-31T04:45:18.3047828Z test pump::registry::tests::disclosable_lines_keeps_the_per_subnet_filter ... ok
2026-07-31T04:45:18.3235307Z test registryhost::tests::apply_feed_batch_writes_snapshots_once_with_per_kind_semantics_parity ... ok
2026-07-31T04:45:18.3265679Z test pump::registry::tests::disclosable_lines_pushes_the_engine_room_only_to_its_chosen_viewer ... ok
2026-07-31T04:45:18.3376436Z test registryhost::tests::apply_feed_gates_and_merges_under_the_lease ... ok
2026-07-31T04:45:18.3392994Z test pump::registry::tests::discover_gate_filters_the_advert_push_per_viewer ... ok
2026-07-31T04:45:18.3452158Z test registryhost::tests::apply_feed_flips_only_on_observed_transition_to_active ... ok
2026-07-31T04:45:18.3564056Z test registryhost::tests::evict_aged_offline_rows_reaps_ghosts_and_rewrites_snapshots ... ok
2026-07-31T04:45:18.3578023Z test registryhost::tests::apply_node_labels_gates_and_merges ... ok
2026-07-31T04:45:18.3681081Z test registryhost::tests::evict_silent_peers_drops_unheard_rows_and_rewrites_snapshots ... ok
2026-07-31T04:45:18.3682355Z test registryhost::tests::gossip_controller_node_covers_any_controller ... ok
2026-07-31T04:45:18.3685683Z test registryhost::tests::recent_projects_cap_fires_on_output_length_not_scanned_rows ... ok
2026-07-31T04:45:18.3688181Z test registryhost::tests::recent_projects_derive_once_per_distinct_cwd ... ok
2026-07-31T04:45:18.4418224Z test pump::registry::tests::pre_round_sweeps_and_refreshes_adverts_each_round ... ok
2026-07-31T04:45:18.4680068Z test registryhost::tests::repair_evict_tombstones_roster_snapshot_and_notices ... ok
2026-07-31T04:45:18.4681200Z test registryhost::tests::superseded_requires_label_and_machine_id_under_other_key ... ok
2026-07-31T04:45:18.5095685Z test registryhost::tests::advertise_local_scans_and_respects_visibility ... ok
2026-07-31T04:45:18.5160529Z test registryhost::tests::with_epoch_is_the_one_canonical_counter ... ok
2026-07-31T04:45:18.5436046Z test registryhost::tests::advertise_local_stamps_the_node_label ... ok
2026-07-31T04:45:18.5695049Z test registryhost::tests::advertised_status_ignores_host_error ... ok
2026-07-31T04:45:21.1234255Z test psyrelay::tests::reply_relays_to_inbound_sender ... ok
2026-07-31T04:45:21.3286348Z test registryhost::tests::advertisement_carries_both_authored_blurb ... ok
2026-07-31T04:45:21.3286929Z test registryhost::tests::advertisement_carries_the_presence_datum ... ok
2026-07-31T04:45:21.3569445Z test relcache::tests::docs_bundle_stages_loads_and_clears_independently ... ok
2026-07-31T04:45:21.3619149Z test relcache::tests::applied_state_two_phase_round_trips_and_degrades ... ok
2026-07-31T04:45:21.3619791Z test relcache::tests::partial_update_set_can_serve_held_platform_only ... ok
2026-07-31T04:45:21.3886576Z test relcache::tests::torn_or_corrupt_stage_offers_nothing ... ok
2026-07-31T04:45:21.3887115Z test relcache::tests::stage_round_trips_and_restage_replaces ... ok
2026-07-31T04:45:21.3991527Z test relcache::tests::single_platform_stamp_is_explicit_and_cleared_on_restage ... ok
2026-07-31T04:45:21.4035246Z test release::tests::artifact_digest_mismatch_is_rejected ... ok
2026-07-31T04:45:21.4067558Z test release::tests::builtin_keys_merge_and_revoke_under_file_overlay ... ok
2026-07-31T04:45:21.4120600Z test release::tests::current_platform_is_registered_or_unknown ... ok
2026-07-31T04:45:21.4122127Z test release::tests::docs_entry_is_additive_and_verifies_exact_bytes ... ok
2026-07-31T04:45:21.4122556Z test release::tests::channel_mismatch_is_rejected ... ok
2026-07-31T04:45:21.4135851Z test release::tests::hex_roundtrips ... ok
2026-07-31T04:45:21.4148871Z test relcache::tests::update_set_round_trips_and_loads_by_platform ... ok
2026-07-31T04:45:21.4149611Z test release::tests::known_triples_project_the_registry ... ok
2026-07-31T04:45:21.4941043Z test release::tests::expired_metadata_is_rejected ... ok
2026-07-31T04:45:21.4941653Z test registryhost::tests::advertisement_follows_resting_transitions_epoch_bumped ... ok
2026-07-31T04:45:21.4955191Z test release::tests::musl_platform_registered ... ok
2026-07-31T04:45:21.4956149Z test release::tests::revoked_key_is_rejected ... ok
2026-07-31T04:45:21.5014367Z test release::tests::shipped_builtin_table_is_well_formed ... ok
2026-07-31T04:45:21.5078411Z test release::tests::production_policy_loads_fail_closed ... ok
2026-07-31T04:45:21.5179130Z test registryhost::tests::erased_perch_is_advertised_offline_not_left_active ... ok
2026-07-31T04:45:21.5314609Z test release::tests::update_set_artifact_mismatch_is_rejected ... ok
2026-07-31T04:45:21.5315266Z test release::tests::tampered_metadata_fails_signature ... ok
2026-07-31T04:45:21.5315698Z test release::tests::non_monotonic_version_is_rollback ... ok
2026-07-31T04:45:21.5316210Z test release::tests::untrusted_key_is_unknown ... ok
2026-07-31T04:45:21.5316642Z test release::tests::update_set_missing_platform_is_typed_rejection ... ok
2026-07-31T04:45:21.5317449Z test release::tests::update_set_tampering_breaks_whole_set_signature ... ok
2026-07-31T04:45:21.5332061Z test release::tests::update_set_channel_and_rollback_gates_hold ... ok
2026-07-31T04:45:21.5378917Z test release::tests::valid_release_verifies_and_artifact_matches ... ok
2026-07-31T04:45:21.5379884Z test release::tests::update_set_verifies_and_selects_platform_artifact ... ok
2026-07-31T04:45:21.5383240Z test resting::tests::apply_event_miss_message_is_single_sourced ... ok
2026-07-31T04:45:21.5636035Z test release::tests::verify_detached_signs_raw_artifact_bytes ... ok
2026-07-31T04:45:21.5948461Z test resting::tests::apply_event_no_spurious_echo_on_cold_void_suspend ... ok
2026-07-31T04:45:21.5950463Z test resting::tests::auto_suspend_counts_from_dormancy_onset_and_is_opt_in ... ok
2026-07-31T04:45:21.6025628Z test resting::tests::apply_event_echo_failure_is_loud_but_state_persists ... ok
2026-07-31T04:45:21.6048863Z test registryhost::tests::evict_silent_peers_never_touches_own_rows ... ok
2026-07-31T04:45:21.6068275Z test resting::tests::effective_rest_state_table ... ok
2026-07-31T04:45:21.6356025Z test resting::tests::freshness_pull_marker_is_taken_exactly_once ... ok
2026-07-31T04:45:21.6357065Z test resting::tests::knob_chain_resolves_global_node_endpoint ... ok
2026-07-31T04:45:21.6433532Z test resting::tests::apply_event_wakes_a_cold_void_perch ... ok
2026-07-31T04:45:21.6657246Z test resting::tests::apply_event_fires_echo_once_per_rest_edge_and_wake_on_wake ... ok
2026-07-31T04:45:21.6659623Z test resting::tests::route_rest_event_contract_table ... ok
2026-07-31T04:45:21.7025040Z test projwriter::tests::failed_cycle_preserves_last_known_good ... ok
2026-07-31T04:45:21.7026341Z test resting::tests::transition_table_matches_the_context_model ... ok
2026-07-31T04:45:21.7029990Z test rollback_compat::tests::pre_ready_durable_files_are_additive_and_n1_readable ... ok
2026-07-31T04:45:21.7239736Z test resting::tests::deferred_held_keys_on_the_durable_rest_record ... ok
2026-07-31T04:45:21.7240324Z test resting::tests::apply_event_auto_suspends_under_the_resolved_chain ... ok
2026-07-31T04:45:21.7420760Z test resting::tests::rest_record_round_trips_with_anchor_discipline ... ok
2026-07-31T04:45:21.7422022Z test resting::tests::suspend_with_broker_liveness_hint_edges_instead_of_no_edge ... ok
2026-07-31T04:45:21.7437906Z test registryhost::tests::the_engine_room_is_absent_from_the_advertisement_until_it_chooses_a_viewer ... ok
2026-07-31T04:45:21.7442132Z test seedproofx::grace_tests::grade_truth_table ... ok
2026-07-31T04:45:21.7450147Z test seedproofx::grace_tests::seed_never_appears_in_roster_gossip ... ok
2026-07-31T04:45:21.7460298Z test seedproofx::grace_tests::seedxfer_frame_round_trips_and_rejects_malformed ... ok
2026-07-31T04:45:21.7463076Z test seedproofx::roster_tests::admin_seed_rides_as_prefixed_sibling_and_routes_to_its_own_seam ... ok
2026-07-31T04:45:21.7466311Z test seedproofx::roster_tests::empty_roster_frame_round_trips ... ok
2026-07-31T04:45:21.7467898Z test seedproofx::roster_tests::malformed_roster_frame_rejected ... ok
2026-07-31T04:45:21.7470087Z test seedproofx::roster_tests::reconcile_fills_absent_keeps_observed_and_skips_self ... ok
2026-07-31T04:45:21.7472511Z test seedproofx::roster_tests::reconcile_refuses_mismatch_and_repairs_invalid_rows ... ok
2026-07-31T04:45:21.7474452Z test seedproofx::roster_tests::reconcile_replaces_a_suspect_row_with_the_validated_roster_address ... ok
2026-07-31T04:45:21.7477014Z test seedproofx::roster_tests::roster_frame_round_trips ... ok
2026-07-31T04:45:21.9255881Z test relay::tests::relay_backlog_never_drains_active_only ... ok
2026-07-31T04:45:21.9257158Z test service::tests::plan_start_prefers_service_then_spawn_idempotent ... ok
2026-07-31T04:45:21.9258735Z test service::tests::plan_stop_routes_managed_then_ipc_then_noop ... ok
2026-07-31T04:45:21.9261063Z test service::tests::run_refused_only_when_windows_and_vanishing ... ok
2026-07-31T04:45:21.9261705Z test service::tests::stale_bare_logon_action_classification ... ok
2026-07-31T04:45:22.2191506Z test relay::tests::respawn_loses_no_spooled_message ... ok
2026-07-31T04:45:22.3751718Z test relay::tests::run_honors_stop ... ok
2026-07-31T04:45:22.3753294Z test servicehost::tests::a_healthy_run_resets_the_fast_exit_counter ... ok
2026-07-31T04:45:22.4575464Z test resting::tests::daemon_rest_event_arms_gate_at_rest_edge_only ... ok
2026-07-31T04:45:23.4646653Z test resting::tests::rest_edges_cascade_shells_with_divergence ... ok
2026-07-31T04:45:23.4651268Z test servicehost::tests::a_newer_daemons_status_row_degrades_instead_of_failing_the_whole_reply ... ok
2026-07-31T04:45:23.4976249Z test projwriter::tests::endpoint_events_patch_rows_and_drop_purged ... ok
2026-07-31T04:45:23.8376359Z test servicehost::tests::a_path_verified_orphan_is_reaped_and_confirmed_by_a_post_kill_read ... ok
2026-07-31T04:45:24.4479854Z test servicehost::tests::a_service_that_exits_instantly_latches_and_stops_relaunching ... ok
2026-07-31T04:45:26.5079319Z test projwriter::tests::warm_start_unchanged_generation_scans_nothing ... ok
2026-07-31T04:45:29.5222577Z test seedmap::tests::put_refreshes_existing ... ok
2026-07-31T04:45:29.5316847Z test seedmap::tests::put_then_take_consumes_once ... ok
2026-07-31T04:45:29.5383654Z test seedmap::tests::request_stop_barrier_holds_until_no_listener ... ok
2026-07-31T04:45:29.5447149Z test seedmap::tests::stop_op_acks_then_serve_returns ... ok
2026-07-31T04:45:29.5514738Z test seedmap::tests::take_absent_is_none ... ok
2026-07-31T04:45:29.5779332Z test serveprobe::tests::is_serving_subnet_honors_membership_and_detach ... ok
2026-07-31T04:45:29.5862301Z test servicehost::tests::a_bind_service_defers_at_boot_and_starts_at_its_bind ... ok
2026-07-31T04:45:30.2870936Z test servicehost::tests::a_boot_service_starts_once_and_the_next_sweep_reads_already_running ... ok
2026-07-31T04:45:30.3032006Z test servicehost::tests::adapter_dir_substitutes_as_one_argv_element_even_with_spaces ... ok
2026-07-31T04:45:30.3032681Z test servicehost::tests::a_stop_kills_the_child_and_re_reads_liveness_after_the_kill ... ok
2026-07-31T04:45:30.6200278Z test servicehost::tests::an_exit_under_an_engaged_hold_stands_down_quiesced_instead_of_latching ... ok
2026-07-31T04:45:30.6242991Z test servicehost::tests::a_startup_fault_carries_what_the_service_said_before_it_died ... ok
2026-07-31T04:45:30.6526687Z test servicehost::tests::an_orphan_pid_running_a_different_image_is_never_killed ... ok
2026-07-31T04:45:30.6527857Z test servicehost::tests::an_orphan_whose_image_cannot_be_verified_is_reported_not_killed ... ok
2026-07-31T04:45:30.6529290Z test servicehost::tests::backoff_doubles_and_saturates ... ok
2026-07-31T04:45:30.6530792Z test servicehost::tests::consecutive_fast_exits_latch_startup_fault_early ... ok
2026-07-31T04:45:30.6543431Z test servicehost::tests::empty_and_dead_orphan_records_read_apart ... ok
2026-07-31T04:45:30.6708548Z test servicehost::tests::ensure_supervised_is_one_instance_per_option_and_refuses_an_unclear_sweep ... ok
2026-07-31T04:45:30.6709737Z test servicehost::tests::hold_outranks_everything ... ok
2026-07-31T04:45:30.6711491Z test servicehost::tests::only_the_three_ruled_opportunities_clear_the_latch ... ok
2026-07-31T04:45:30.6712904Z test servicehost::tests::quiesce_engages_the_hold_before_placing_the_stop_marker ... ok
2026-07-31T04:45:31.0548223Z test servicehost::tests::a_held_option_is_refused_by_a_clearing_sweep_and_starts_only_when_the_hold_releases ... ok
2026-07-31T04:45:31.0549675Z test servicehost::tests::slow_crashes_latch_the_ordinary_give_up_not_startup_fault ... ok
2026-07-31T04:45:31.0551401Z test servicehost::tests::start_trigger_decides_which_opportunities_start_it ... ok
2026-07-31T04:45:31.7903602Z test servicehost::tests::a_silent_daemon_times_the_caller_out_instead_of_wedging_it ... ok
2026-07-31T04:45:31.8479006Z test registryhost::tests::recent_projects_for_dedups_newest_first_excludes_owlery ... ok
2026-07-31T04:45:32.1321000Z test servicehost::tests::a_latched_option_reports_the_captured_evidence_behind_its_latch ... ok
2026-07-31T04:45:32.4897228Z test servicehost::tests::a_service_that_exits_on_the_stop_marker_quiesces_cooperatively ... ok
2026-07-31T04:45:32.4907130Z test servicehost::tests::the_service_command_resolves_its_program_through_the_install_dir_helper ... ok
2026-07-31T04:45:32.4908640Z test servicehost::tests::the_service_spawn_scrubs_the_session_identity_env ... ok
2026-07-31T04:45:32.4915031Z test servicehost::tests::the_spawn_environment_carries_the_cli_capability ... ok
2026-07-31T04:45:32.4916352Z test servicehost::tests::the_spawn_environment_carries_the_per_option_identity ... ok
2026-07-31T04:45:33.5004913Z test servicehost::tests::a_service_that_ignores_the_stop_marker_is_force_killed_and_confirmed_dead ... ok
2026-07-31T04:45:33.5009007Z test servicehost::tests::a_soft_deregistered_adapters_service_never_starts_in_the_first_place ... ok
2026-07-31T04:45:33.5022353Z test servicehost::tests::a_status_read_mints_no_hold_flag_for_the_option_it_reports ... ok
2026-07-31T04:45:33.5036069Z test shellchan::tests::activity_frame_parses_back_through_the_public_decoder ... ok
2026-07-31T04:45:33.5042511Z test shellchan::tests::activity_frame_shape_is_the_published_one ... ok
2026-07-31T04:45:33.5048947Z test shellchan::tests::drive_frame_shape_mirrors_sensory ... ok
2026-07-31T04:45:33.5055685Z test shellchan::tests::frames_compose_and_stamp_roundtrips ... ok
2026-07-31T04:45:33.6358746Z test shellchan::tests::restamp_carries_pending_rows_across_rotation ... ok
2026-07-31T04:45:33.6360387Z test shellchan::tests::sensory_text_file_frames_shape ... ok
2026-07-31T04:45:33.6366192Z test shellchan::tests::vocab_check_bounds_ops_and_args ... ok
2026-07-31T04:45:33.6539008Z test shelldisc::tests::discover_across_joins_other_node_subnet_adapters ... ok
2026-07-31T04:45:33.6917746Z test shelldisc::tests::discovery_lists_a_dead_pid_instance_offline ... ok
2026-07-31T04:45:33.7574585Z test shelldisc::tests::discovery_own_plus_broadcast_gated_instantiable ... ok
2026-07-31T04:45:33.7814241Z test shelldisc::tests::shell_context_renders_sections_and_empties_to_none ... ok
2026-07-31T04:45:33.7817214Z test shellhost::tests::a_daemon_that_launches_is_the_only_launcher ... ok
2026-07-31T04:45:33.7820522Z test shellhost::tests::a_late_ack_loser_adopts_the_winner_instead_of_spawning ... ok
2026-07-31T04:45:33.7823484Z test shellhost::tests::a_post_ack_failure_never_spawns_again ... ok
2026-07-31T04:45:33.7826298Z test shellhost::tests::a_post_ack_silence_is_indeterminate_not_failure ... ok
2026-07-31T04:45:33.7831423Z test shellhost::tests::a_pre_ack_refusal_falls_back_in_process ... ok
2026-07-31T04:45:33.8530096Z test shellhost::tests::a_spawn_program_the_install_dir_does_not_ship_falls_through_to_path ... ok
2026-07-31T04:45:33.8577450Z test shellhost::tests::a_spawn_template_resolves_its_program_and_adapter_dir_against_the_install_dir ... ok
2026-07-31T04:45:33.8581269Z test shellhost::tests::an_answered_refusal_never_consults_the_arbiter ... ok
2026-07-31T04:45:33.8589121Z test shellhost::tests::an_unserved_socket_is_a_pre_ack_refusal ... ok
2026-07-31T04:45:34.2395686Z test servicehost::tests::the_startup_capture_is_reclaimed_once_the_run_proves_it_starts ... ok
2026-07-31T04:45:35.1015783Z test servicehost::tests::a_stood_down_supervisors_latch_outlives_its_thread_and_suppresses_the_next_sweep ... ok
2026-07-31T04:45:36.4019123Z test servicehost::tests::a_supervised_option_no_longer_declared_still_appears_as_undeclared ... ok
2026-07-31T04:45:36.7021701Z test shellhost::tests::gateway_typed_owner_spawns_and_owns_a_shell ... ok
2026-07-31T04:45:37.1250764Z test shellhost::tests::close_shell_dead_child_is_prompt_and_manifestless_never_erases ... ok
2026-07-31T04:45:37.1259216Z test shellhost::tests::close_shell_ephemeral_tears_down_and_frees_the_slot ... ok
2026-07-31T04:45:37.1286087Z test shellhost::tests::link_key_and_frame_mac_roundtrip ... ok
2026-07-31T04:45:37.1286800Z test shellhost::tests::close_shell_delivers_pre_close_then_kills_and_flips_offline ... ok
2026-07-31T04:45:37.1291829Z test shellhost::tests::only_the_relay_receipt_routes_through_the_daemon ... ok
2026-07-31T04:45:37.1528408Z test servicehost::tests::a_supervisor_whose_declaration_is_gone_is_torn_down_by_the_next_sweep ... ok
2026-07-31T04:45:37.1640713Z test shellhost::tests::spawn_template_perch_dir_fills_as_one_argv_element ... ok
2026-07-31T04:45:37.1647279Z test shellhost::tests::the_arbiter_does_not_block_an_uncontested_fallback ... ok
2026-07-31T04:45:37.1668581Z test shellhost::tests::only_a_live_recorded_pid_wins_a_launch_race ... ok
2026-07-31T04:45:37.1669514Z test shellwake::tests::backoff_curve_doubles_to_the_cap ... ok
2026-07-31T04:45:37.1718206Z test shellwake::tests::a_wake_template_resolves_its_program_and_adapter_dir_against_the_install_dir ... ok
2026-07-31T04:45:37.1848860Z test shellhost::tests::spawn_template_without_perch_dir_is_unchanged ... ok
2026-07-31T04:45:37.2070284Z test shellhost::tests::launch_fails_closed_on_bad_templates ... ok
2026-07-31T04:45:37.2349629Z test shellwake::tests::reconcile_never_adopts_a_stale_online_instance ... ok
2026-07-31T04:45:37.2388865Z test shellwake::tests::resolve_wake_refuses_without_a_reachable_owner ... ok
2026-07-31T04:45:37.2539480Z test shellwake::tests::reconcile_resolves_profile_overlay ... ok
2026-07-31T04:45:37.2545735Z test shellwake::tests::the_wake_catalog_shares_the_spawn_vocabulary_but_is_not_the_same_set ... ok
2026-07-31T04:45:37.3562753Z test servicehost::tests::an_adapter_scoped_sweep_neither_starts_nor_stops_another_adapters_service ... ok
2026-07-31T04:45:37.3828151Z test servicehost::tests::an_unknown_op_closes_the_connection_instead_of_wedging_the_caller ... ok
2026-07-31T04:45:37.3834180Z test servicehost::tests::quiesce_raises_the_hold_before_it_can_place_any_stop_marker ... ok
2026-07-31T04:45:37.3916234Z test stderrlog::tests::roll_keeps_bounded_generations_and_preserves_current ... ok
2026-07-31T04:45:37.3929290Z test stderrlog::tests::roll_with_keep_one_clears_without_backup ... ok
2026-07-31T04:45:37.3935404Z test stderrlog::tests::should_roll_at_or_over_cap_only ... ok
2026-07-31T04:45:37.3935830Z test sync::tests::gate_decision_table ... ok
2026-07-31T04:45:37.3998825Z test servicehost::tests::the_advisory_line_is_read_bounded_and_never_dressed_up_when_absent ... ok
2026-07-31T04:45:37.4672083Z test shellwake::tests::resolve_wake_leaves_a_dormant_owner_and_relaunches ... ok
2026-07-31T04:45:37.5415338Z test shellhost::tests::launch_parks_token_and_bind_by_token_onlines ... ok
2026-07-31T04:45:37.5422275Z test translation::tests::inject_floor_buffers_while_held_then_drains_in_order ... ok
2026-07-31T04:45:37.5423769Z test translation::tests::key_cmd_parses_each_wire_shape ... ok
2026-07-31T04:45:37.5425188Z test translation::tests::key_to_bytes_send_keys_map ... ok
2026-07-31T04:45:37.5426997Z test translation::tests::to_binary_serializes_to_wire_and_input_is_content_free ... ok
2026-07-31T04:45:37.5432584Z test transport::tests::local_socket_handshake_and_frame_round_trip ... ok
2026-07-31T04:45:37.5436197Z test transport::tests::local_socket_rejects_wrong_role ... ok
2026-07-31T04:45:37.5437594Z test tunnelhub::tests::clear_evicts_the_entry ... ok
2026-07-31T04:45:37.5439430Z test tunnelhub::tests::dead_generation_stream_is_never_surfaced ... ok
2026-07-31T04:45:37.5441172Z test tunnelhub::tests::entries_are_per_owner ... ok
2026-07-31T04:45:37.5443189Z test tunnelhub::tests::relink_overwrites_the_entry_with_a_fresh_generation ... ok
2026-07-31T04:45:37.5444796Z test tunnelhub::tests::resolve_serves_each_end_under_the_opening_token ... ok
2026-07-31T04:45:37.5447047Z test update::tests::apply_refuses_non_brain_only_plan ... ok
2026-07-31T04:45:37.5448834Z test update::tests::classify_brain_only_when_broker_hosts_new_brain ... ok
2026-07-31T04:45:37.5452496Z test update::tests::classify_broker_breaking_on_resource_abi_change ... ok
2026-07-31T04:45:37.5453220Z test update::tests::classify_broker_compatible_when_brain_below_floor ... ok
2026-07-31T04:45:37.5635315Z test update::tests::plan_verified_produces_no_plan_for_a_rejected_release ... ok
2026-07-31T04:45:37.5902269Z test update::tests::plan_verified_update_set_uses_selected_platform_spec ... ok
2026-07-31T04:45:37.5994928Z test update::tests::plan_verified_yields_a_plan_for_a_valid_release ... ok
2026-07-31T04:45:37.9194230Z test servicehost::tests::the_hold_outlives_the_force_killed_supervision_it_ended ... ok
2026-07-31T04:45:37.9196047Z test wan::tests::origin_user_backed_matrix ... ok
2026-07-31T04:45:38.4016330Z test shellwake::tests::watcher_opcode_exit_fires_resolution_once ... ok
2026-07-31T04:45:38.4018116Z test wan::tests::wan_ingress_empty_from_renders_origin_node_label ... ok
2026-07-31T04:45:38.4019441Z test wan::tests::wan_outcome_token_round_trips_and_unknown_is_noreply ... ok
2026-07-31T04:45:38.4021082Z test wan::tests::wan_user_msg_restamped_unless_origin_user_backed ... ok
2026-07-31T04:45:38.4237344Z test xfer::tests::recv_state_chunks_idempotent_and_commit_replays_safely ... ok
2026-07-31T04:45:38.4239052Z test xfer::tests::resolve_under_confines_to_root ... ok
2026-07-31T04:45:38.4983295Z test servicehost::tests::the_projection_reports_a_live_supervisor_with_its_declaration_and_advisory ... ok
2026-07-31T04:45:38.4993818Z test servicehost::tests::the_projection_scopes_to_one_adapter_and_keeps_deregistered_declarations ... ok
2026-07-31T04:45:38.5090485Z test servicehost::tests::the_status_op_reports_over_the_wire_and_starts_nothing ... ok
2026-07-31T04:45:39.6633736Z test servicehost::tests::the_stop_marker_is_never_visible_before_the_hold_is_up ... ok
2026-07-31T04:45:39.7004724Z test translation::tests::flagged_spawn_still_starts ... ok
2026-07-31T04:45:39.8575826Z test shellwake::tests::reconcile_flips_watchers_with_instance_state ... ok
2026-07-31T04:45:40.7097004Z test projwriter::tests::batched_complexity_counters_hold has been running for over 60 seconds
2026-07-31T04:45:41.2226068Z test shellwake::tests::resolve_wake_revives_a_suspended_owner_without_double_launch ... ok
2026-07-31T04:45:41.2301519Z test stderrlog::tests::path_under_home_and_stamp_is_legible ... ok
2026-07-31T04:45:41.2362345Z test projwriter::tests::parity_full_ordered_list_vs_legacy_oracle has been running for over 60 seconds
2026-07-31T04:45:41.4137809Z test wan::tests::no_binary_wan_arrival_spools_not_pty ... ok
2026-07-31T04:45:41.4249992Z test wan::tests::the_stamp_not_the_from_is_the_sender_subject ... ok
2026-07-31T04:45:43.9810124Z test shellwake::tests::watcher_crash_exits_respawn_then_give_up ... ok
2026-07-31T04:46:03.1217601Z test sync::tests::reconcile_driver_structurally_excludes_live_role ... ok
2026-07-31T04:46:05.6001030Z test projwriter::tests::batched_complexity_counters_hold ... ok
2026-07-31T04:46:15.1256309Z test sync::tests::select_refs_scopes_two_tiers ... ok
2026-07-31T04:46:25.3141257Z test projwriter::tests::parity_full_ordered_list_vs_legacy_oracle ... ok
2026-07-31T04:46:25.3141653Z 
2026-07-31T04:46:25.3141730Z failures:
2026-07-31T04:46:25.3142905Z 
2026-07-31T04:46:25.3143871Z ---- daemon::tests::a_captured_spawn_inherits_only_the_handle_in_its_allowlist stdout ----
2026-07-31T04:46:25.3145290Z DETACH_BREAKAWAY_DENIED: the Job Object of the LAUNCHING process (spt_daemon-4d86a85ce347685e.exe pid=35272) forbids breakaway; spawned IN-JOB — the child belongs to THAT job and dies with it
2026-07-31T04:46:25.3145988Z 
2026-07-31T04:46:25.3146394Z thread 'daemon::tests::a_captured_spawn_inherits_only_the_handle_in_its_allowlist' (34016) panicked at crates\spt-daemon\src\daemon.rs:2166:9:
2026-07-31T04:46:25.3147370Z the child inherited a handle that was NOT in the allowlist — the allowlist is not doing the job that makes bInheritHandles = TRUE safe here
2026-07-31T04:46:25.3147836Z 
2026-07-31T04:46:25.3147840Z 
2026-07-31T04:46:25.3147913Z failures:
2026-07-31T04:46:25.3148186Z     daemon::tests::a_captured_spawn_inherits_only_the_handle_in_its_allowlist
2026-07-31T04:46:25.3148461Z 
2026-07-31T04:46:25.3148708Z test result: FAILED. 722 passed; 1 failed; 0 ignored; 0 measured; 0 filtered out; finished in 140.93s
2026-07-31T04:46:25.3149051Z 
2026-07-31T04:46:25.3236240Z error: test failed, to rerun pass `-p spt-daemon --lib`
2026-07-31T04:46:25.3826032Z ##[error]Process completed with exit code 1.
